{"text_format":"1","workbook":"xlsx","n_sheets":9,"sheets":["マニュアル","【様式１】実施希望調書","Footer","【様式１】b","Sheet1","【分野】","選択肢","マスター_都道府県CD","分野（様式反映用）"],"not_rendered":{"charts":0,"images":3,"macros":1,"external_links":0,"defined_names":13,"comments":0,"pivot_tables":0},"unopened":[],"bounds":{"document_bytes":16777216,"sheet_cells":100000,"rows_first":2000,"rows_last":500,"rows_between":2000,"halvings":0,"cell_chars":16384,"cell_head_chars":4096},"cells_cut":0,"cells_raw":0,"read":"whole","date_system":"1900"}

{"sheet":"マニュアル","index":0,"n_rows":116,"n_cols":18,"rows_kept":116,"cut":false,"hidden":false,"merged":[]}
[]
[]
[]
[]
[]
[]
[null,null,null,"注意事項"]
[]
[null,null,null,"ℹ 申請書ファイルの名称には、「【様式２～４】」が含まれていることが必要です。"]
[null,null,null,"  他の部分は任意の文字列に変更しても問題ありません。 "]
{"$rows_left_out":107}
{"sheet":"【様式１】実施希望調書","index":1,"n_rows":19,"n_cols":24,"rows_kept":19,"cut":false,"hidden":false,"merged":[[13,0,13,13],[13,18,13,22],[3,0,5,2],[1,0,1,23],[3,18,3,22],[4,18,4,22],[5,18,5,22],[3,3,5,4],[3,5,5,5],[3,13,3,14],[4,13,4,14],[5,13,5,14],[3,15,3,17],[4,15,4,17],[5,15,5,17]]}
[null,null,null,null,null,null,null,null,null,null,null,null,null,null,null,null,null,null,null,null,null,null,null,"データ提出"]
[]
[]
["参加校数",null,null,{"$f":"COUNT(tSummary[応募No.])","v":5},null,"校",null,null,null,null,null,null,null,"都道府県・\n政令指定都市名",null,"北海道",null,null,"TEL",null,null,null,null,"000-0000-0000"]
[null,null,null,null,null,null,null,null,null,null,null,null,null,"担当部（局）課",null,"●●県教育庁△△課",null,null,"FAX",null,null,null,null,"000-0000-0000"]
[null,null,null,null,null,null,null,null,null,null,null,null,null,"担当者氏名",null,"●●　●●",null,null,"E-MAIL",null,null,null,null,"ｘｘｘｘｘｘ＠xx.xxx"]
[]
["応募No.","推薦\n順位","実施希望校","実施\n回数","実施日\n1回目","実施日\n2回目","実施日\n3回目","講師氏名\n※本名","実施分野\n大項目","実施分野\n中項目","補助者人数\n1回目","補助者人数\n2回目","補助者人数\n3回目","補助者人数\n合計","謝金","旅費","講演等諸雑費","合計","過疎","山村","離島","半島","奄美／\n小笠原","備考"]
[{"$f":"ROW()-8","v":1},2,{"$f":"IFERROR(INDEX(【様式１】b!J:J,MATCH(【様式１】実施希望調書!A9,【様式１】b!H:H,0)),\"\")","v":"○○市立文化小学校"},{"$f":"IFERROR(INDEX(【様式１】b!AA:AA,MATCH(tSummary[応募No.],【様式１】b!H:H,0)),\"\")","v":3},{"$f":"IF(LEN(INDEX(【様式１】b!AM:AM,MATCH(tSummary[応募No.],【様式１】b!H:H,0)))=0,\"\",INDEX(【様式１】b!AM:AM,MATCH(tSummary[応募No.],【様式１】b!H:H,0)))","v":"2022-06-10"},{"$f":"IF(LEN(INDEX(【様式１】b!CQ:CQ,MATCH(tSummary[応募No.],【様式１】b!H:H,0)))=0,\"\",INDEX(【様式１】b!CQ:CQ,MATCH(tSummary[応募No.],【様式１】b!H:H,0)))","v":"2022-06-17"},{"$f":"IF(LEN(INDEX(【様式１】b!EU:EU,MATCH(tSummary[応募No.],【様式１】b!H:H,0)))=0,\"\",INDEX(【様式１】b!EU:EU,MATCH(tSummary[応募No.],【様式１】b!H:H,0)))","v":"2022-06-23"},{"$f":"IFERROR(INDEX(【様式１】b!AB:AB,MATCH(tSummary[応募No.],【様式１】b!H:H,0)),\"\")","v":"芸術　花子"},{"$f":"IFERROR(INDEX(【様式１】b!X:X,MATCH(tSummary[応募No.],【様式１】b!H:H,0)),\"\")","v":"音楽"},{"$f":"IFERROR(INDEX(【様式１】b!Y:Y,MATCH(tSummary[応募No.],【様式１】b!H:H,0)),\"\")","v":"C　弦楽器"},{"$f":"IFERROR(INDEX(【様式１】b!CN:CN,MATCH(tSummary[応募No.],【様式１】b!H:H,0)),0)","v":3},{"$f":"IFERROR(INDEX(【様式１】b!ER:ER,MATCH(tSummary[応募No.],【様式１】b!H:H,0)),0)","v":3},{"$f":"IFERROR(INDEX(【様式１】b!GV:GV,MATCH(tSummary[応募No.],【様式１】b!H:H,0)),0)","v":5},{"$f":"SUM(K9+L9+M9)","v":11},{"$f":"IFERROR(INDEX(【様式１】b!GY:GY,MATCH(tSummary[応募No.],【様式１】b!H:H,0)),0)","v":267230},{"$f":"IFERROR(INDEX(【様式１】b!GZ:GZ,MATCH(tSummary[応募No.],【様式１】b!H:H,0)),0)","v":65590},{"$f":"IFERROR(INDEX(【様式１】b!HA:HA,MATCH(tSummary[応募No.],【様式１】b!H:H,0)),0)","v":48700},{"$f":"SUM(O9:Q9)","v":381520},"○"]
[2,null,{"$f":"IFERROR(INDEX(【様式１】b!J:J,MATCH(【様式１】実施希望調書!A10,【様式１】b!H:H,0)),\"\")","v":"△△市立△△小学校"},{"$f":"IFERROR(INDEX(【様式１】b!AA:AA,MATCH(tSummary[応募No.],【様式１】b!H:H,0)),\"\")","v":1},{"$f":"IF(LEN(INDEX(【様式１】b!AM:AM,MATCH(tSummary[応募No.],【様式１】b!H:H,0)))=0,\"\",INDEX(【様式１】b!AM:AM,MATCH(tSummary[応募No.],【様式１】b!H:H,0)))","v":"2022-07-01"},{"$f":"IF(LEN(INDEX(【様式１】b!CQ:CQ,MATCH(tSummary[応募No.],【様式１】b!H:H,0)))=0,\"\",INDEX(【様式１】b!CQ:CQ,MATCH(tSummary[応募No.],【様式１】b!H:H,0)))","v":""},{"$f":"IF(LEN(INDEX(【様式１】b!EU:EU,MATCH(tSummary[応募No.],【様式１】b!H:H,0)))=0,\"\",INDEX(【様式１】b!EU:EU,MATCH(tSummary[応募No.],【様式１】b!H:H,0)))","v":""},{"$f":"IFERROR(INDEX(【様式１】b!AB:AB,MATCH(tSummary[応募No.],【様式１】b!H:H,0)),\"\")","v":"◎◎　◎◎"},{"$f":"IFERROR(INDEX(【様式１】b!X:X,MATCH(tSummary[応募No.],【様式１】b!H:H,0)),\"\")","v":"音楽"},{"$f":"IFERROR(INDEX(【様式１】b!Y:Y,MATCH(tSummary[応募No.],【様式１】b!H:H,0)),\"\")","v":"D　パーカッション"},{"$f":"IFERROR(INDEX(【様式１】b!CN:CN,MATCH(tSummary[応募No.],【様式１】b!H:H,0)),0)","v":5},{"$f":"IFERROR(INDEX(【様式１】b!ER:ER,MATCH(tSummary[応募No.],【様式１】b!H:H,0)),0)","v":0},{"$f":"IFERROR(INDEX(【様式１】b!GV:GV,MATCH(tSummary[応募No.],【様式１】b!H:H,0)),0)","v":0},5,{"$f":"IFERROR(INDEX(【様式１】b!GY:GY,MATCH(tSummary[応募No.],【様式１】b!H:H,0)),0)","v":133450},{"$f":"IFERROR(INDEX(【様式１】b!GZ:GZ,MATCH(tSummary[応募No.],【様式１】b!H:H,0)),0)","v":3000},{"$f":"IFERROR(INDEX(【様式１】b!HA:HA,MATCH(tSummary[応募No.],【様式１】b!H:H,0)),0)","v":27600},164050,null,null,null,"○"]
{"$rows_left_out":10}
{"sheet":"Footer","index":2,"n_rows":6,"n_cols":1,"rows_kept":6,"cut":false,"hidden":true,"merged":[[0,0,0,13],[0,18,0,22]]}
["　　計"]
["※域内において推薦順位を指定する場合は推薦順位を入力してください。推薦順位が特にない場合は空欄のままとしてください。"]
["※　「過疎地域自立促進特別措置法」、「山村振興法」、「離島振興法」、「半島振興法」、「奄美群島振興開発特別措置法」、"]
["\n　 　「小笠原諸島振興開発特別措置法」の定める地域に該当する場合は、「過疎」、「山村」、「離島」、「半島」、「奄美・小笠原」欄に○印をつけてください。"]
["※本事業で得た個人情報は、本事業内のみで使用します"]
["※本事業の専用ウェブページにある[個人情報について]に同意していただいたものとします"]

{"sheet":"【様式１】b","index":3,"n_rows":6,"n_cols":216,"rows_kept":6,"cut":false,"hidden":true,"merged":[]}
[null,"都道府県名","都道府県担当部局","都道府県担当者氏名","都道府県TEL","都道府県FAX","都道府県メール","応募No.","推薦\n順位","実施希望校","実施希望校ふりがな","全校児童生徒","所在地郵便番号前","実施校所在地郵便番号後","実施校所在地都道府県","実施校所在地住所","実施校学校長名","実施校担当者名","実施校TEL","実施校FAX","実施校メール","実施会場","合同開催","実施分野大項目","実施分野中項目","実施分野補足","実施\n回数","講師氏名","講師氏名ふりがな","所属団体","学校との関係","学校との関係その他","協力者名簿","連続実施年数同一講師","連続実施年数同一分野","連続実施確認１","連続実施理由項目","連続実施理由詳細","実施日第1回","実施時間1回目","実施合計1回目","連続する実施1回目","連続都道府県1回目","連続学校名1回目","教科の位置付け1回目","教科の位置付け詳細1回目","著作権1回目","著作権許諾取得有無1回目","参加児童生徒数1回目","参加児童生徒単位1回目","参加児童生徒単位詳細1回目","補助者①氏名1回目","補助者①演奏時間1回目","補助者①実技時間1回目","補助者①単労時間1回目","補助者①謝金合計1回目","補助者②氏名1回目","補助者②演奏時間1回目","補助者②実技時間1回目","補助者②単労時間1回目","補助者②謝金合計1回目","補助者③氏名1回目","補助者③演奏時間1回目","補助者③実技時間1回目","補助者③単労時間1回目","補助者③謝金合計1回目","補助者④氏名1回目","補助者④演奏時間1回目","補助者④実技時間1回目","補助者④単労時間1回目","補助者④謝金合計1回目","補助者⑤氏名1回目","補助者⑤演奏時間1回目","補助者⑤実技時間1回目","補助者⑤単労時間1回目","補助者⑤謝金合計1回目","補助者⑥氏名1回目","補助者⑥演奏時間1回目","補助者⑥実技時間1回目","補助者⑥単労時間1回目","補助者⑥謝金合計1回目","補助者⑦氏名1回目","補助者⑦演奏時間1回目","補助者⑦実技時間1回目","補助者⑦単労時間1回目","補助者⑦謝金合計1回目","補助者⑧氏名1回目","補助者⑧演奏時間1回目","補助者⑧実技時間1回目","補助者⑧単労時間1回目","補助者⑧謝金合計1回目","1回目補助者人数","1回目謝金合計","事業内容1回目","実施日第2回","実施時間2回目","実施合計2回目","連続する実施2回目","連続都道府県2回目","連続学校名2回目","教科の位置付け2回目","教科の位置付け詳細2回目","著作権2回目","著作権許諾取得有無2回目","参加児童生徒数2回目","参加児童生徒単位2回目","参加児童生徒単位詳細2回目","補助者①氏名2回目","補助者①演奏時間2回目","補助者①実技時間2回目","補助者①単労時間2回目","補助者①謝金合計2回目","補助者②氏名2回目","補助者②演奏時間2回目","補助者②実技時間2回目","補助者②単労時間2回目","補助者②謝金合計2回目","補助者③氏名2回目","補助者③演奏時間2回目","補助者③実技時間2回目","補助者③単労時間2回目","補助者③謝金合計2回目","補助者④氏名2回目","補助者④演奏時間2回目","補助者④実技時間2回目","補助者④単労時間2回目","補助者④謝金合計2回目","補助者⑤氏名2回目","補助者⑤演奏時間2回目","補助者⑤実技時間2回目","補助者⑤単労時間2回目","補助者⑤謝金合計2回目","補助者⑥氏名2回目","補助者⑥演奏時間2回目","補助者⑥実技時間2回目","補助者⑥単労時間2回目","補助者⑥謝金合計2回目","補助者⑦氏名2回目","補助者⑦演奏時間2回目","補助者⑦実技時間2回目","補助者⑦単労時間2回目","補助者⑦謝金合計2回目","補助者⑧氏名2回目","補助者⑧演奏時間2回目","補助者⑧実技時間2回目","補助者⑧単労時間2回目","補助者⑧謝金合計2回目","2回目補助者人数","2回目謝金合計","事業内容2回目","実施日第3回","実施時間3回目","実施合計3回目","連続する実施3回目","連続都道府県3回目","連続学校名3回目","教科の位置付け3回目","教科の位置付け詳細3回目","著作権3回目","著作権許諾取得有無3回目","参加児童生徒数3回目","参加児童生徒単位3回目","参加児童生徒単位詳細3回目","補助者①氏名3回目","補助者①演奏時間3回目","補助者①実技時間3回目","補助者①単労時間3回目","補助者①謝金合計3回目","補助者②氏名3回目","補助者②演奏時間3回目","補助者②実技時間3回目","補助者②単労時間3回目","補助者②謝金合計3回目","補助者③氏名3回目","補助者③演奏時間3回目","補助者③実技時間3回目","補助者③単労時間3回目","補助者③謝金合計3回目","補助者④氏名3回目","補助者④演奏時間3回目","補助者④実技時間3回目","補助者④単労時間3回目","補助者④謝金合計3回目","補助者⑤氏名3回目","補助者⑤演奏時間3回目","補助者⑤実技時間3回目","補助者⑤単労時間3回目","補助者⑤謝金合計3回目","補助者⑥氏名3回目","補助者⑥演奏時間3回目","補助者⑥実技時間3回目","補助者⑥単労時間3回目","補助者⑥謝金合計3回目","補助者⑦氏名3回目","補助者⑦演奏時間3回目","補助者⑦実技時間3回目","補助者⑦単労時間3回目","補助者⑦謝金合計3回目","補助者⑧氏名3回目","補助者⑧演奏時間3回目","補助者⑧実技時間3回目","補助者⑧単労時間3回目","補助者⑧謝金合計3回目","3回目補助者人数","3回目謝金合計","事業内容3回目","謝金","旅費","講演等\n諸雑費","合計","過疎","山村","離島","半島","奄美／\n小笠原","備考"]
[null,null,null,null,null,null,null,1,null,"○○市立文化小学校","○○しりつ　ぶんか　しょうがっこう",300,"***","****","北海道","○○市　△△　1-1-1","◇◇　◇◇","□□　□□","00-0000-0000","00-0000-1111","xxx@xxxx.xx.xx","実施校の教室・体育館","なし","音楽","C　弦楽器",null,3,"芸術　花子","げいじゅつ　はなこ","●●室内管弦楽団","卒業生",null,"登録済み",2,4,"確認済み","希望する講師が芸術分野以外にも申請校が求める専門スキルを所有しており他の講師での実施が困難（福祉現場での活動経験が豊富等）","本校では毎年、芸術文化の鑑賞や活動体験を通して、子供たちの豊かな情操を育み、芸術に親しむ感性を養うことを目的として芸術家の派遣事業を活用している。本校の児童の特性として、発達に困難を抱えた児童が多く、毎年異なる講師を迎えることは、子供たちへ不安や緊張といったストレスをかける要因となり、本来の目的達成に支障が生じてしまう。本校が希望する○○先生は本校の児童の特性に深く理解があり、教員側・保護者側からも安心して実施をお任せできることから、令和4年度も継続して○○先生を講師に迎えることを希望する。","2022-06-10","午前",90,"有","北海道","◎◎市立芸術中学校","教科","音楽","許諾が必要","許諾取得済み",100,"学年単位","5，6年生","次代　太郎",1,1,null,11720,"音楽　花子",1,1,null,11720,"演奏　太郎",1,1,null,11720,null,null,null,null,0,null,null,null,null,0,null,null,null,null,0,null,null,null,null,0,null,null,null,null,0,3,35160,"○○○○○○○○○○○○○○○○○○○○○○○○○○○○○○○○○○○○○○○○○○○○○○○○○○○○○○○○○○○○○○○○○○○○○○○○○○○○○○○○○○○○○○○○○○○○○○○○○○○○○○○○○○○○○○○○○○○○○○○○○○○○○○○○○○○○○○○○○○○○○○○○○○○○○○○○○○○○○○○○○○○○○○○○○○○○","2022-06-17","午後",150,"無",null,null,"総合的な学習の時間",null,"許諾は不要",null,100,"学年単位","5，6年生","次代　太郎",2,1,null,18240,"音楽　花子",2,1,null,18240,"演奏　太郎",2,1,null,18240,null,null,null,null,0,null,null,null,null,0,null,null,null,null,0,null,null,null,null,0,null,null,null,null,0,3,54720,"○○○○○○○○○○○○○○○○○○○○○○○○○○○○○○○○○○○○○○○○○○○○○○○○○○○○○○○○○○○○○○○○○○○○○○○○○○○○○○○○○○○○○○○○○○○○○○○○○○○○○○○○○○○○○○○○○○○○○○○○○○○○○○○○○○○○○○○○○○○○○○○○○○○○○○○○○○○○○○○○○○○○○○○○○○○○","2022-06-23","午前と午後",150,"無",null,null,"特別活動","文化的行事","許諾が必要","許諾未取得",300,"全校児童/生徒",null,"次代　太郎",2,1,null,18240,"音楽　花子",2,null,null,13040,"演奏　太郎",2,null,null,13040,"弦楽　花子",2,null,null,13040,"鍵盤　太郎",2,null,null,13040,null,null,null,null,0,null,null,null,null,0,null,null,null,null,0,5,70400,"○○○○○○○○○○○○○○○○○○○○○○○○○○○○○○○○○○○○○○○○○○○○○○○○○○○○○○○○○○○○○○○○○○○○○○○○○○○○○○○○○○○○○○○○○○○○○○○○○○○○○○○○○○○○○○○○○○○○○○○○○○○○○○○○○○○○○○○○○○○○○○○○○○○○○○○○○○○○○○○○○○○○○○○○○○○○",267230,65590,48700,381520]
[null,null,null,null,null,null,null,2,null,"△△市立△△小学校","○○しりつ　ぶんか　しょうがっこう",300,"***","****","北海道","○○市　△△　1-1-1","◇◇　◇◇","□□　□□","00-0000-0000","00-0000-1111","xxx@xxxx.xx.xx","実施校の教室・体育館","なし","音楽","D　パーカッション",null,1,"◎◎　◎◎","げいじゅつ　はなこ","●●室内管弦楽団","卒業生",null,"登録済み",2,4,"確認済み","希望する講師が芸術分野以外にも申請校が求める専門スキルを所有しており他の講師での実施が困難（福祉現場での活動経験が豊富等）","本校では毎年、芸術文化の鑑賞や活動体験を通して、子供たちの豊かな情操を育み、芸術に親しむ感性を養うことを目的として芸術家の派遣事業を活用している。本校の児童の特性として、発達に困難を抱えた児童が多く、毎年異なる講師を迎えることは、子供たちへ不安や緊張といったストレスをかける要因となり、本来の目的達成に支障が生じてしまう。本校が希望する○○先生は本校の児童の特性に深く理解があり、教員側・保護者側からも安心して実施をお任せできることから、令和4年度も継続して○○先生を講師に迎えることを希望する。","2022-07-01","午前",90,"有","北海道","◎◎市立芸術中学校","教科","音楽","許諾が必要","許諾取得済み",100,"学年単位","5，6年生","次代　太郎",3,null,null,19560,"音楽　花子",3,null,null,19560,"演奏　太郎",3,null,null,19560,"ああ　ああ",3,null,null,19560,"いい　いい",3,null,null,19560,null,null,null,null,0,null,null,null,null,0,null,null,null,null,0,5,97800,"○○○○○○○○○○○○○○○○○○○○○○○○○○○○○○○○○○○○○○○○○○○○○○○○○○○○○○○○○○○○○○○○○○○○○○○○○○○○○○○○○○○○○○○○○○○○○○○○○○○○○○○○○○○○○○○○○○○○○○○○○○○○○○○○○○○○○○○○○○○○○○○○○○○○○○○○○○○○○○○○○○○○○○○○○○○○",null,null,null,null,null,null,null,null,null,null,null,null,null,null,null,null,null,0,null,null,null,null,0,null,null,null,null,0,null,null,null,null,0,null,null,null,null,0,null,null,null,null,0,null,null,null,null,0,null,null,null,null,0,0,0,"○○○○○○○○○○○○○○○○○○○○○○○○○○○○○○○○○○○○○○○○○○○○○○○○○○○○○○○○○○○○○○○○○○○○○○○○○○○○○○○○○○○○○○○○○○○○○○○○○○○○○○○○○○○○○○○○○○○○○○○○○○○○○○○○○○○○○○○○○○○○○○○○○○○○○○○○○○○○○○○○○○○○○○○○○○○○",null,null,null,null,null,null,null,null,null,null,null,null,null,null,null,null,null,0,null,null,null,null,0,null,null,null,null,0,null,null,null,null,0,null,null,null,null,0,null,null,null,null,0,null,null,null,null,0,null,null,null,null,0,0,0,"○○○○○○○○○○○○○○○○○○○○○○○○○○○○○○○○○○○○○○○○○○○○○○○○○○○○○○○○○○○○○○○○○○○○○○○○○○○○○○○○○○○○○○○○○○○○○○○○○○○○○○○○○○○○○○○○○○○○○○○○○○○○○○○○○○○○○○○○○○○○○○○○○○○○○○○○○○○○○○○○○○○○○○○○○○○○",133450,3000,27600,164050]
[null,null,null,null,null,null,null,3,null,"△△市立△△中学校","○○しりつ　ぶんか　しょうがっこう",300,"***","****","北海道","○○市　△△　1-1-1","◇◇　◇◇","□□　□□","00-0000-0000","00-0000-1111","xxx@xxxx.xx.xx","実施校の教室・体育館","なし","文学","A　俳句",null,3,"□□　□□","げいじゅつ　はなこ","●●室内管弦楽団","卒業生",null,"登録済み",2,4,"確認済み","希望する講師が芸術分野以外にも申請校が求める専門スキルを所有しており他の講師での実施が困難（福祉現場での活動経験が豊富等）","本校では毎年、芸術文化の鑑賞や活動体験を通して、子供たちの豊かな情操を育み、芸術に親しむ感性を養うことを目的として芸術家の派遣事業を活用している。本校の児童の特性として、発達に困難を抱えた児童が多く、毎年異なる講師を迎えることは、子供たちへ不安や緊張といったストレスをかける要因となり、本来の目的達成に支障が生じてしまう。本校が希望する○○先生は本校の児童の特性に深く理解があり、教員側・保護者側からも安心して実施をお任せできることから、令和4年度も継続して○○先生を講師に迎えることを希望する。","2022-06-03","午前",90,"有","北海道","◎◎市立芸術中学校","教科","音楽","許諾が必要","許諾取得済み",100,"学年単位","5，6年生","次代　太郎",1,1,null,11720,"音楽　花子",1,1,null,11720,null,null,null,null,0,null,null,null,null,0,null,null,null,null,0,null,null,null,null,0,null,null,null,null,0,null,null,null,null,0,2,23440,"○○○○○○○○○○○○○○○○○○○○○○○○○○○○○○○○○○○○○○○○○○○○○○○○○○○○○○○○○○○○○○○○○○○○○○○○○○○○○○○○○○○○○○○○○○○○○○○○○○○○○○○○○○○○○○○○○○○○○○○○○○○○○○○○○○○○○○○○○○○○○○○○○○○○○○○○○○○○○○○○○○○○○○○○○○○○","2022-06-12","午後",150,"無",null,null,"総合的な学習の時間",null,"許諾は不要",null,100,"学年単位","5，6年生","次代　太郎",2,1,null,18240,null,null,null,null,0,null,null,null,null,0,null,null,null,null,0,null,null,null,null,0,null,null,null,null,0,null,null,null,null,0,null,null,null,null,0,1,18240,"○○○○○○○○○○○○○○○○○○○○○○○○○○○○○○○○○○○○○○○○○○○○○○○○○○○○○○○○○○○○○○○○○○○○○○○○○○○○○○○○○○○○○○○○○○○○○○○○○○○○○○○○○○○○○○○○○○○○○○○○○○○○○○○○○○○○○○○○○○○○○○○○○○○○○○○○○○○○○○○○○○○○○○○○○○○○","2022-07-14","午前と午後",150,"無",null,null,"特別活動","文化的行事","許諾が必要","許諾未取得",300,"全校児童/生徒",null,"次代　太郎",2,1,null,18240,null,null,null,null,0,null,null,null,null,0,null,null,null,null,0,null,null,null,null,0,null,null,null,null,0,null,null,null,null,0,null,null,null,null,0,1,18240,"○○○○○○○○○○○○○○○○○○○○○○○○○○○○○○○○○○○○○○○○○○○○○○○○○○○○○○○○○○○○○○○○○○○○○○○○○○○○○○○○○○○○○○○○○○○○○○○○○○○○○○○○○○○○○○○○○○○○○○○○○○○○○○○○○○○○○○○○○○○○○○○○○○○○○○○○○○○○○○○○○○○○○○○○○○○○",166870,6250,30000,203120]
[null,null,null,null,null,null,null,4,null,"○○市立○○中学校","○○しりつ　ぶんか　しょうがっこう",300,"***","****","北海道","○○市　△△　1-1-1","◇◇　◇◇","□□　□□","00-0000-0000","00-0000-1111","xxx@xxxx.xx.xx","実施校の教室・体育館","なし","メディア芸術","A　メディアアート",null,2,"◇◇　◇◇","げいじゅつ　はなこ","●●室内管弦楽団","卒業生",null,"登録済み",2,4,"確認済み","希望する講師が芸術分野以外にも申請校が求める専門スキルを所有しており他の講師での実施が困難（福祉現場での活動経験が豊富等）","本校では毎年、芸術文化の鑑賞や活動体験を通して、子供たちの豊かな情操を育み、芸術に親しむ感性を養うことを目的として芸術家の派遣事業を活用している。本校の児童の特性として、発達に困難を抱えた児童が多く、毎年異なる講師を迎えることは、子供たちへ不安や緊張といったストレスをかける要因となり、本来の目的達成に支障が生じてしまう。本校が希望する○○先生は本校の児童の特性に深く理解があり、教員側・保護者側からも安心して実施をお任せできることから、令和4年度も継続して○○先生を講師に迎えることを希望する。","2022-06-10","午前",90,"有","北海道","◎◎市立芸術中学校","教科","音楽","許諾が必要","許諾取得済み",100,"学年単位","5，6年生","次代　太郎",null,2,null,10400,null,null,null,null,0,null,null,null,null,0,null,null,null,null,0,null,null,null,null,0,null,null,null,null,0,null,null,null,null,0,null,null,null,null,0,1,10400,"○○○○○○○○○○○○○○○○○○○○○○○○○○○○○○○○○○○○○○○○○○○○○○○○○○○○○○○○○○○○○○○○○○○○○○○○○○○○○○○○○○○○○○○○○○○○○○○○○○○○○○○○○○○○○○○○○○○○○○○○○○○○○○○○○○○○○○○○○○○○○○○○○○○○○○○○○○○○○○○○○○○○○○○○○○○○","2022-06-17","午後",150,"無",null,null,"総合的な学習の時間",null,"許諾は不要",null,100,"学年単位","5，6年生","次代　太郎",null,3,null,15600,"メディア　花子",null,3,null,15600,null,null,null,null,0,null,null,null,null,0,null,null,null,null,0,null,null,null,null,0,null,null,null,null,0,null,null,null,null,0,2,31200,"○○○○○○○○○○○○○○○○○○○○○○○○○○○○○○○○○○○○○○○○○○○○○○○○○○○○○○○○○○○○○○○○○○○○○○○○○○○○○○○○○○○○○○○○○○○○○○○○○○○○○○○○○○○○○○○○○○○○○○○○○○○○○○○○○○○○○○○○○○○○○○○○○○○○○○○○○○○○○○○○○○○○○○○○○○○○",null,null,null,"無",null,null,null,null,null,"許諾未取得",null,null,null,null,null,null,null,0,null,null,null,null,0,null,null,null,null,0,"弦楽　花子",null,null,null,0,"鍵盤　太郎",null,null,null,0,null,null,null,null,0,null,null,null,null,0,null,null,null,null,0,2,0,null,97300,65590,48700,211590]
[null,null,null,null,null,null,null,5,null,"○○県立○○高等学校","○○しりつ　ぶんか　しょうがっこう",300,"***","****","北海道","○○市　△△　1-1-1","◇◇　◇◇","□□　□□","00-0000-0000","00-0000-1111","xxx@xxxx.xx.xx","実施校の教室・体育館","なし","音楽","C　弦楽器",null,3,"芸術　花子","げいじゅつ　はなこ","●●室内管弦楽団","卒業生",null,"登録済み",2,4,"確認済み","希望する講師が芸術分野以外にも申請校が求める専門スキルを所有しており他の講師での実施が困難（福祉現場での活動経験が豊富等）","本校では毎年、芸術文化の鑑賞や活動体験を通して、子供たちの豊かな情操を育み、芸術に親しむ感性を養うことを目的として芸術家の派遣事業を活用している。本校の児童の特性として、発達に困難を抱えた児童が多く、毎年異なる講師を迎えることは、子供たちへ不安や緊張といったストレスをかける要因となり、本来の目的達成に支障が生じてしまう。本校が希望する○○先生は本校の児童の特性に深く理解があり、教員側・保護者側からも安心して実施をお任せできることから、令和4年度も継続して○○先生を講師に迎えることを希望する。","2022-10-02","午前",90,"有","北海道","◎◎市立芸術中学校","教科","音楽","許諾が必要","許諾取得済み",100,"学年単位","5，6年生",null,null,null,null,0,null,null,null,null,0,null,null,null,null,0,null,null,null,null,0,null,null,null,null,0,null,null,null,null,0,null,null,null,null,0,null,null,null,null,0,0,0,"○○○○○○○○○○○○○○○○○○○○○○○○○○○○○○○○○○○○○○○○○○○○○○○○○○○○○○○○○○○○○○○○○○○○○○○○○○○○○○○○○○○○○○○○○○○○○○○○○○○○○○○○○○○○○○○○○○○○○○○○○○○○○○○○○○○○○○○○○○○○○○○○○○○○○○○○○○○○○○○○○○○○○○○○○○○○","2022-11-11","午後",150,"無",null,null,"総合的な学習の時間",null,"許諾は不要",null,100,"学年単位","5，6年生",null,null,null,null,0,null,null,null,null,0,null,null,null,null,0,null,null,null,null,0,null,null,null,null,0,null,null,null,null,0,null,null,null,null,0,null,null,null,null,0,0,0,"○○○○○○○○○○○○○○○○○○○○○○○○○○○○○○○○○○○○○○○○○○○○○○○○○○○○○○○○○○○○○○○○○○○○○○○○○○○○○○○○○○○○○○○○○○○○○○○○○○○○○○○○○○○○○○○○○○○○○○○○○○○○○○○○○○○○○○○○○○○○○○○○○○○○○○○○○○○○○○○○○○○○○○○○○○○○","2022-12-04","午前と午後",150,"無",null,null,"特別活動","文化的行事","許諾が必要","許諾未取得",300,"全校児童/生徒",null,null,null,null,null,0,null,null,null,null,0,null,null,null,null,0,null,null,null,null,0,null,null,null,null,0,null,null,null,null,0,null,null,null,null,0,null,null,null,null,0,0,0,"○○○○○○○○○○○○○○○○○○○○○○○○○○○○○○○○○○○○○○○○○○○○○○○○○○○○○○○○○○○○○○○○○○○○○○○○○○○○○○○○○○○○○○○○○○○○○○○○○○○○○○○○○○○○○○○○○○○○○○○○○○○○○○○○○○○○○○○○○○○○○○○○○○○○○○○○○○○○○○○○○○○○○○○○○○○○",106950,1500,48700,157150]

{"sheet":"Sheet1","index":4,"n_rows":201,"n_cols":10,"rows_kept":201,"cut":false,"hidden":true,"merged":[]}
["実施希望校","【様式２・３】実施希望調書!E7",null,"実施希望校","【様式２・３】実施希望調書!E7",null,{"$f":"EXACT(A1,D1)","v":true},null,null,"【様式２・３】実施希望調書!E7"]
["実施希望校ふりがな","【様式２・３】実施希望調書!E6",null,"実施希望校ふりがな","【様式２・３】実施希望調書!E6",null,{"$f":"EXACT(A2,D2)","v":true},null,null,"【様式２・３】実施希望調書!E6"]
["全校児童生徒","【様式２・３】実施希望調書!W6",null,"全校児童生徒","【様式２・３】実施希望調書!W6",null,true,null,null,"【様式２・３】実施希望調書!W6"]
["所在地郵便番号前","【様式２・３】実施希望調書!F8",null,"所在地郵便番号前","【様式２・３】実施希望調書!F8",null,true,null,null,"【様式２・３】実施希望調書!F8"]
["実施校所在地郵便番号後","【様式２・３】実施希望調書!J8",null,"実施校所在地郵便番号後","【様式２・３】実施希望調書!J8",null,true,null,null,"【様式２・３】実施希望調書!J8"]
["実施校所在地都道府県","【様式２・３】実施希望調書!P8",null,"実施校所在地都道府県","【様式２・３】実施希望調書!P8",null,true,null,null,"【様式２・３】実施希望調書!P8"]
["実施校所在地住所","【様式２・３】実施希望調書!E9",null,"実施校所在地住所","【様式２・３】実施希望調書!E9",null,true,null,null,"【様式２・３】実施希望調書!E9"]
["実施校学校長名","【様式２・３】実施希望調書!W8",null,"実施校学校長名","【様式２・３】実施希望調書!W8",null,true,null,null,"【様式２・３】実施希望調書!W8"]
["実施校担当者名","【様式２・３】実施希望調書!W9",null,"実施校担当者名","【様式２・３】実施希望調書!W9",null,true,null,null,"【様式２・３】実施希望調書!W9"]
["実施校TEL","【様式２・３】実施希望調書!W10",null,"実施校TEL","【様式２・３】実施希望調書!E10",null,true,null,null,"【様式２・３】実施希望調書!W10"]
{"$rows_left_out":192}
{"sheet":"【分野】","index":5,"n_rows":12,"n_cols":34,"rows_kept":12,"cut":false,"hidden":false,"merged":[[10,28,10,31],[10,32,10,35],[11,0,11,35],[9,25,9,27],[9,29,9,31],[9,32,9,35],[10,1,10,3],[10,5,10,7],[10,9,10,11],[10,13,10,15],[10,17,10,19],[10,21,10,23],[10,24,10,27],[9,1,9,3],[9,5,9,7],[9,9,9,11],[9,13,9,15],[9,17,9,19],[9,21,9,23],[7,33,7,35],[8,1,8,3],[8,5,8,7],[8,9,8,11],[8,13,8,15],[8,16,8,19],[8,20,8,23],[8,24,8,27],[8,28,8,31],[8,32,8,35],[6,29,6,31],[6,32,6,35],[7,1,7,3],[7,5,7,7],[7,9,7,11],[7,13,7,15],[7,17,7,19],[7,21,7,23],[7,25,7,27],[7,29,7,31],[5,24,5,27],[5,28,5,31],[5,32,5,35],[6,1,6,3],[6,5,6,7],[6,9,6,11],[6,13,6,15],[6,17,6,19],[6,21,6,23],[6,25,6,27],[5,1,5,3],[5,5,5,7],[5,9,5,11],[5,13,5,15],[5,17,5,19],[5,21,5,23],[4,20,4,23],[4,24,4,27],[4,28,4,31],[4,32,4,35],[3,1,3,3],[3,5,3,7],[3,9,3,11],[3,13,3,15],[3,17,3,19],[4,1,4,3],[4,5,4,7],[4,9,4,11],[4,13,4,15],[4,17,4,19],[3,20,3,23],[3,24,3,27],[3,28,3,31],[3,32,3,35],[0,0,0,35],[1,0,1,3],[1,4,1,35],[2,1,2,3],[2,5,2,7],[2,9,2,11],[2,13,2,15],[2,17,2,19],[2,21,2,23],[2,25,2,27],[2,28,2,31],[2,32,2,35]]}
["【分野】"]
["大項目",null,null,null,"中項目"]
[1,"音楽",null,null,"A","ピアノ",null,null,"B","声楽",null,null,"C","弦楽器",null,null,"D","パーカッション",null,null,"E","管楽器",null,null,"F","その他"]
[2,"演劇",null,null,"A","現代劇",null,null,"B","ミュージカル",null,null,"C","人形劇",null,null,"D","その他"]
[3,"舞踊",null,null,"A","バレエ",null,null,"B","現代舞踊",null,null,"C","身体表現",null,null,"D","その他"]
[4,"大衆芸能",null,null,"A","落語",null,null,"B","講談",null,null,"C","漫才",null,null,"D","浪曲",null,null,"E","その他"]
[5,"美術",null,null,"A","洋画",null,null,"B","日本画",null,null,"C","版画",null,null,"D","彫刻",null,null,"E","書",null,null,"F","写真",null,null,"G","その他"]
[6,"伝統芸能",null,null,"A","歌舞伎",null,null,"B","　能楽",null,null,"C","人形浄瑠璃",null,null,"D","日本舞踊",null,null,"E","和太鼓",null,null,"F","箏",null,null,"G","三味線",null,null,"H","その他"]
[7,"文学",null,null,"A","俳句",null,null,"B","朗読",null,null,"C","その他"]
[8,"生活文化",null,null,"A","囲碁",null,null,"B","将棋",null,null,"C","華道",null,null,"D","茶道",null,null,"E","和装",null,null,"F","食文化",null,null,"G","その他"]
{"$rows_left_out":3}
{"sheet":"選択肢","index":6,"n_rows":68,"n_cols":2,"rows_kept":68,"cut":false,"hidden":true,"merged":[]}
["NO","都道府県"]
[1,"北海道"]
[2,"青森県"]
[3,"岩手県"]
[4,"宮城県"]
[5,"秋田県"]
[6,"山形県"]
[7,"福島県"]
[8,"茨城県"]
[9,"栃木県"]
{"$rows_left_out":59}
{"sheet":"マスター_都道府県CD","index":7,"n_rows":1212,"n_cols":25,"rows_kept":1212,"cut":false,"hidden":true,"merged":[]}
["教受付NO","都道府県","教受付NO"]
[1,"北海道",1]
[2,"青森県",2]
[3,"岩手県",3]
[4,"宮城県",4]
[5,"秋田県",5]
[6,"山形県",6]
[7,"福島県",7]
[8,"茨城県",8]
[9,"栃木県",9]
{"$rows_left_out":1203}
{"sheet":"分野（様式反映用）","index":8,"n_rows":11,"n_cols":12,"rows_kept":11,"cut":false,"hidden":true,"merged":[]}
[]
[null,null,null,"音楽","演劇","舞踊","大衆芸能","美術","伝統芸能","文学","生活文化","メディア芸術"]
[1,"音楽",null,"A　ピアノ","A　現代劇","A　バレエ","A　落語","A　洋画","A　歌舞伎","A　俳句","A　囲碁","A　メディアアート"]
[2,"演劇",null,"B　声楽","B　ミュージカル","B　現代舞踊","B　講談","B　日本画","B　能楽","B　朗読","B　将棋","B　映画"]
[3,"舞踊",null,"C　弦楽器","C　人形劇","C　身体表現","C　漫才","C　版画","C　人形浄瑠璃","C　その他","C　華道","C　アニメーション"]
[4,"大衆芸能",null,"D　パーカッション","D　その他","D　その他","D　浪曲","D　彫刻","D　日本舞踊",null,"D　茶道","D　マンガ"]
[5,"美術",null,"E　管楽器",null,null,"E　その他","E　書","E　和太鼓",null,"E　和装","E　その他"]
[6,"伝統芸能",null,"F　その他",null,null,null,"F　写真","F　箏",null,"F　食文化"]
[7,"文学",null,null,null,null,null,"G　その他","G　三味線",null,"G　その他"]
[8,"生活文化",null,null,null,null,null,null,"H　その他"]
{"$rows_left_out":1}