{"text_format":"1","workbook":"xlsx","n_sheets":9,"sheets":["マニュアル","【様式１】実施希望調書","Footer","【様式１】b","Sheet1","【分野】","選択肢","マスター_都道府県CD","分野（様式反映用）"],"not_rendered":{"charts":0,"images":3,"macros":1,"external_links":0,"defined_names":13,"comments":0,"pivot_tables":0},"unopened":[],"bounds":{"document_bytes":16777216,"sheet_cells":100000,"rows_first":2000,"rows_last":500,"rows_between":2000,"halvings":0,"cell_chars":16384,"cell_head_chars":4096},"cells_cut":0,"cells_raw":0,"read":"whole","date_system":"1900"}

{"sheet":"マニュアル","index":0,"n_rows":116,"n_cols":18,"rows_kept":116,"cut":false,"hidden":false,"merged":[]}
[]
[]
[]
[]
[]
[]
[null,null,null,"注意事項"]
[]
[null,null,null,"ℹ 申請書ファイルの名称には、「【様式２～４】」が含まれていることが必要です。"]
[null,null,null,"  他の部分は任意の文字列に変更しても問題ありません。 "]
[]
[null,null,null,"ℹ このファイルと申請書ファイルは、フォルダ内の同一階層に保存してください。"]
[]
[]
[]
[null,null,null,"⚠ 様式1にはマクロ計算機能を使用しております。"]
[null,null,null,"　 お使いのパソコンの設定を「マクロを有効」とした状態で作業を行ってください。"]
[null,null,null,"⚠ シートの追加・削除、シート名の変更はできません。 "]
[null,null,null,"⚠ 申請内容の修正等でフォルダ内に修正前・後の申請書ファイルが混在する場合、"]
[null,null,null," 　不要なデータを含んだ一覧表が生成されてしまいます。"]
[null,null,null," 　修正前のファイルなど集約対象外のものはフォルダから取り除いてください。 "]
[null,null,null,"⚠ 集計後は、青色セルの部分を直接編集することができません。個別の実施希望調書（様式2～4）"]
[null,null,null," 　の内容に変更や誤りがないことを確認の上、集約作業を行ってください。"]
[null,null,null,"⚠ 一度集計した学校は、個別に差替え・削除することができません。申請の取下げを行う場合は"]
[null,null,null," 　集計を初めからやり直すか、申請時に取下げを行う学校をお申し出ください。"]
[null,null,null," 　また差替えが発生する場合は、集計を初めからやり直すか、差替えデータを取り込んだ別の様式１を"]
[null,null,null," 　一緒にご提出ください。"]
[]
[]
[]
[]
[null,null,null,"準備"]
[]
[]
[null,null,null,null,null,null,null,null,null,null,null,null,null,null,null,null,null,"デスクトップなど、任意のわかりやすい場所に、"]
[null,null,null,null,null,null,null,null,null,null,null,null,null,null,null,null,null,"作業用フォルダを作成してください。"]
[null,null,null,null,null,null,null,null,null,null,null,null,null,null,null,null,null,"フォルダ名に制約はありません。"]
[]
[]
[]
[]
[]
[]
[]
[]
[]
[null,null,null,null,null,null,null,null,null,null,null,null,null,null,null,null,null,"作成したフォルダ内の同一階層に、このファイルと"]
[null,null,null,null,null,null,null,null,null,null,null,null,null,null,null,null,null,"各校から提出されたファイル類をすべて格納してください。"]
[]
[null,null,null,null,null,null,null,null,null,null,null,null,null,null,null,null,null,"【様式２～４】以外のファイルが混在しても構いません。"]
[]
[]
[]
[]
[]
[null,null,null,"⚠ ファイル名順に「1、2、3…」と応募No.が付番されますので、都道府県内において特定の学校順での"]
[null,null,null,"　 集約が必要である場合は、あらかじめ個別表のファイル名に付番してから作業を行ってください。"]
[]
[]
[]
[]
[]
[]
[]
[]
[]
[]
[]
[]
[]
[]
[]
[]
[]
[]
[]
[]
[]
[]
[]
[]
[]
[]
[]
[]
[]
[]
[]
[]
[]
[]
[]
[]
[]
[]
[]
[]
[]
[null,null,null,"前頁 準備の項を終えたら、① のボタンをクリックしてください。処理が始まります。"]
[null,null,null,"処理が終了するとメッセージが表示され、「【様式１】実施希望調書」が生成されます。"]
[null,null,null,"１回処理をするごとに、フォルダ内の本ファイル以外のファイルは処理済フォルダに移動されます。"]
[null,null,null,"個別表のファイル名と【様式２・３】実施希望調書シートに応募No.が付番されます。"]
[]
[]
[null,null,null,"ℹ 数次にわたって集計を行う場合"]
[null,null,null,"週毎にその前週に届いた申請書を集計するなど、何回かに渡って集約処理を行うことができます。"]
[null,null,null,"都度、本ファイルと同一フォルダに対象の申請書ファイルを置いて① のボタンをクリックしてください。"]
[null,null,null,"応募No. は前回の最後の番号の次が付番され、前回作成の実施希望調書の末尾に新しい集約対象"]
[null,null,null,"の行が追加されます。"]
[]
[]
[null,null,null,"ℹ すべてのデータを削除し、最初から集約をやり直す場合"]
[null,null,null,"② のボタンをクリックすると、作成済みの【様式１】実施希望調書のデータはすべて削除され、"]
[null,null,null,"初期状態に戻ります。"]
[null,null,null,"※ R4【様式２～４】実施希望調書（個別表）ファイルに付番された応募No.は初期化されません。"]
[null,null,null,"　 再度集約した際に書き換えられます。"]

{"sheet":"【様式１】実施希望調書","index":1,"n_rows":19,"n_cols":24,"rows_kept":19,"cut":false,"hidden":false,"merged":[[13,0,13,13],[13,18,13,22],[3,0,5,2],[1,0,1,23],[3,18,3,22],[4,18,4,22],[5,18,5,22],[3,3,5,4],[3,5,5,5],[3,13,3,14],[4,13,4,14],[5,13,5,14],[3,15,3,17],[4,15,4,17],[5,15,5,17]]}
[null,null,null,null,null,null,null,null,null,null,null,null,null,null,null,null,null,null,null,null,null,null,null,"データ提出"]
[]
[]
["参加校数",null,null,{"$f":"COUNT(tSummary[応募No.])","v":5},null,"校",null,null,null,null,null,null,null,"都道府県・\n政令指定都市名",null,"北海道",null,null,"TEL",null,null,null,null,"000-0000-0000"]
[null,null,null,null,null,null,null,null,null,null,null,null,null,"担当部（局）課",null,"●●県教育庁△△課",null,null,"FAX",null,null,null,null,"000-0000-0000"]
[null,null,null,null,null,null,null,null,null,null,null,null,null,"担当者氏名",null,"●●　●●",null,null,"E-MAIL",null,null,null,null,"ｘｘｘｘｘｘ＠xx.xxx"]
[]
["応募No.","推薦\n順位","実施希望校","実施\n回数","実施日\n1回目","実施日\n2回目","実施日\n3回目","講師氏名\n※本名","実施分野\n大項目","実施分野\n中項目","補助者人数\n1回目","補助者人数\n2回目","補助者人数\n3回目","補助者人数\n合計","謝金","旅費","講演等諸雑費","合計","過疎","山村","離島","半島","奄美／\n小笠原","備考"]
[{"$f":"ROW()-8","v":1},2,{"$f":"IFERROR(INDEX(【様式１】b!J:J,MATCH(【様式１】実施希望調書!A9,【様式１】b!H:H,0)),\"\")","v":"○○市立文化小学校"},{"$f":"IFERROR(INDEX(【様式１】b!AA:AA,MATCH(tSummary[応募No.],【様式１】b!H:H,0)),\"\")","v":3},{"$f":"IF(LEN(INDEX(【様式１】b!AM:AM,MATCH(tSummary[応募No.],【様式１】b!H:H,0)))=0,\"\",INDEX(【様式１】b!AM:AM,MATCH(tSummary[応募No.],【様式１】b!H:H,0)))","v":"2022-06-10"},{"$f":"IF(LEN(INDEX(【様式１】b!CQ:CQ,MATCH(tSummary[応募No.],【様式１】b!H:H,0)))=0,\"\",INDEX(【様式１】b!CQ:CQ,MATCH(tSummary[応募No.],【様式１】b!H:H,0)))","v":"2022-06-17"},{"$f":"IF(LEN(INDEX(【様式１】b!EU:EU,MATCH(tSummary[応募No.],【様式１】b!H:H,0)))=0,\"\",INDEX(【様式１】b!EU:EU,MATCH(tSummary[応募No.],【様式１】b!H:H,0)))","v":"2022-06-23"},{"$f":"IFERROR(INDEX(【様式１】b!AB:AB,MATCH(tSummary[応募No.],【様式１】b!H:H,0)),\"\")","v":"芸術　花子"},{"$f":"IFERROR(INDEX(【様式１】b!X:X,MATCH(tSummary[応募No.],【様式１】b!H:H,0)),\"\")","v":"音楽"},{"$f":"IFERROR(INDEX(【様式１】b!Y:Y,MATCH(tSummary[応募No.],【様式１】b!H:H,0)),\"\")","v":"C　弦楽器"},{"$f":"IFERROR(INDEX(【様式１】b!CN:CN,MATCH(tSummary[応募No.],【様式１】b!H:H,0)),0)","v":3},{"$f":"IFERROR(INDEX(【様式１】b!ER:ER,MATCH(tSummary[応募No.],【様式１】b!H:H,0)),0)","v":3},{"$f":"IFERROR(INDEX(【様式１】b!GV:GV,MATCH(tSummary[応募No.],【様式１】b!H:H,0)),0)","v":5},{"$f":"SUM(K9+L9+M9)","v":11},{"$f":"IFERROR(INDEX(【様式１】b!GY:GY,MATCH(tSummary[応募No.],【様式１】b!H:H,0)),0)","v":267230},{"$f":"IFERROR(INDEX(【様式１】b!GZ:GZ,MATCH(tSummary[応募No.],【様式１】b!H:H,0)),0)","v":65590},{"$f":"IFERROR(INDEX(【様式１】b!HA:HA,MATCH(tSummary[応募No.],【様式１】b!H:H,0)),0)","v":48700},{"$f":"SUM(O9:Q9)","v":381520},"○"]
[2,null,{"$f":"IFERROR(INDEX(【様式１】b!J:J,MATCH(【様式１】実施希望調書!A10,【様式１】b!H:H,0)),\"\")","v":"△△市立△△小学校"},{"$f":"IFERROR(INDEX(【様式１】b!AA:AA,MATCH(tSummary[応募No.],【様式１】b!H:H,0)),\"\")","v":1},{"$f":"IF(LEN(INDEX(【様式１】b!AM:AM,MATCH(tSummary[応募No.],【様式１】b!H:H,0)))=0,\"\",INDEX(【様式１】b!AM:AM,MATCH(tSummary[応募No.],【様式１】b!H:H,0)))","v":"2022-07-01"},{"$f":"IF(LEN(INDEX(【様式１】b!CQ:CQ,MATCH(tSummary[応募No.],【様式１】b!H:H,0)))=0,\"\",INDEX(【様式１】b!CQ:CQ,MATCH(tSummary[応募No.],【様式１】b!H:H,0)))","v":""},{"$f":"IF(LEN(INDEX(【様式１】b!EU:EU,MATCH(tSummary[応募No.],【様式１】b!H:H,0)))=0,\"\",INDEX(【様式１】b!EU:EU,MATCH(tSummary[応募No.],【様式１】b!H:H,0)))","v":""},{"$f":"IFERROR(INDEX(【様式１】b!AB:AB,MATCH(tSummary[応募No.],【様式１】b!H:H,0)),\"\")","v":"◎◎　◎◎"},{"$f":"IFERROR(INDEX(【様式１】b!X:X,MATCH(tSummary[応募No.],【様式１】b!H:H,0)),\"\")","v":"音楽"},{"$f":"IFERROR(INDEX(【様式１】b!Y:Y,MATCH(tSummary[応募No.],【様式１】b!H:H,0)),\"\")","v":"D　パーカッション"},{"$f":"IFERROR(INDEX(【様式１】b!CN:CN,MATCH(tSummary[応募No.],【様式１】b!H:H,0)),0)","v":5},{"$f":"IFERROR(INDEX(【様式１】b!ER:ER,MATCH(tSummary[応募No.],【様式１】b!H:H,0)),0)","v":0},{"$f":"IFERROR(INDEX(【様式１】b!GV:GV,MATCH(tSummary[応募No.],【様式１】b!H:H,0)),0)","v":0},5,{"$f":"IFERROR(INDEX(【様式１】b!GY:GY,MATCH(tSummary[応募No.],【様式１】b!H:H,0)),0)","v":133450},{"$f":"IFERROR(INDEX(【様式１】b!GZ:GZ,MATCH(tSummary[応募No.],【様式１】b!H:H,0)),0)","v":3000},{"$f":"IFERROR(INDEX(【様式１】b!HA:HA,MATCH(tSummary[応募No.],【様式１】b!H:H,0)),0)","v":27600},164050,null,null,null,"○"]
[3,null,{"$f":"IFERROR(INDEX(【様式１】b!J:J,MATCH(【様式１】実施希望調書!A11,【様式１】b!H:H,0)),\"\")","v":"△△市立△△中学校"},{"$f":"IFERROR(INDEX(【様式１】b!AA:AA,MATCH(tSummary[応募No.],【様式１】b!H:H,0)),\"\")","v":3},{"$f":"IF(LEN(INDEX(【様式１】b!AM:AM,MATCH(tSummary[応募No.],【様式１】b!H:H,0)))=0,\"\",INDEX(【様式１】b!AM:AM,MATCH(tSummary[応募No.],【様式１】b!H:H,0)))","v":"2022-06-03"},{"$f":"IF(LEN(INDEX(【様式１】b!CQ:CQ,MATCH(tSummary[応募No.],【様式１】b!H:H,0)))=0,\"\",INDEX(【様式１】b!CQ:CQ,MATCH(tSummary[応募No.],【様式１】b!H:H,0)))","v":"2022-06-12"},{"$f":"IF(LEN(INDEX(【様式１】b!EU:EU,MATCH(tSummary[応募No.],【様式１】b!H:H,0)))=0,\"\",INDEX(【様式１】b!EU:EU,MATCH(tSummary[応募No.],【様式１】b!H:H,0)))","v":"2022-07-14"},{"$f":"IFERROR(INDEX(【様式１】b!AB:AB,MATCH(tSummary[応募No.],【様式１】b!H:H,0)),\"\")","v":"□□　□□"},{"$f":"IFERROR(INDEX(【様式１】b!X:X,MATCH(tSummary[応募No.],【様式１】b!H:H,0)),\"\")","v":"文学"},{"$f":"IFERROR(INDEX(【様式１】b!Y:Y,MATCH(tSummary[応募No.],【様式１】b!H:H,0)),\"\")","v":"A　俳句"},{"$f":"IFERROR(INDEX(【様式１】b!CN:CN,MATCH(tSummary[応募No.],【様式１】b!H:H,0)),0)","v":2},{"$f":"IFERROR(INDEX(【様式１】b!ER:ER,MATCH(tSummary[応募No.],【様式１】b!H:H,0)),0)","v":1},{"$f":"IFERROR(INDEX(【様式１】b!GV:GV,MATCH(tSummary[応募No.],【様式１】b!H:H,0)),0)","v":1},4,{"$f":"IFERROR(INDEX(【様式１】b!GY:GY,MATCH(tSummary[応募No.],【様式１】b!H:H,0)),0)","v":166870},{"$f":"IFERROR(INDEX(【様式１】b!GZ:GZ,MATCH(tSummary[応募No.],【様式１】b!H:H,0)),0)","v":6250},{"$f":"IFERROR(INDEX(【様式１】b!HA:HA,MATCH(tSummary[応募No.],【様式１】b!H:H,0)),0)","v":30000},203120]
[4,null,{"$f":"IFERROR(INDEX(【様式１】b!J:J,MATCH(【様式１】実施希望調書!A12,【様式１】b!H:H,0)),\"\")","v":"○○市立○○中学校"},{"$f":"IFERROR(INDEX(【様式１】b!AA:AA,MATCH(tSummary[応募No.],【様式１】b!H:H,0)),\"\")","v":2},{"$f":"IF(LEN(INDEX(【様式１】b!AM:AM,MATCH(tSummary[応募No.],【様式１】b!H:H,0)))=0,\"\",INDEX(【様式１】b!AM:AM,MATCH(tSummary[応募No.],【様式１】b!H:H,0)))","v":"2022-06-10"},{"$f":"IF(LEN(INDEX(【様式１】b!CQ:CQ,MATCH(tSummary[応募No.],【様式１】b!H:H,0)))=0,\"\",INDEX(【様式１】b!CQ:CQ,MATCH(tSummary[応募No.],【様式１】b!H:H,0)))","v":"2022-06-17"},{"$f":"IF(LEN(INDEX(【様式１】b!EU:EU,MATCH(tSummary[応募No.],【様式１】b!H:H,0)))=0,\"\",INDEX(【様式１】b!EU:EU,MATCH(tSummary[応募No.],【様式１】b!H:H,0)))","v":""},{"$f":"IFERROR(INDEX(【様式１】b!AB:AB,MATCH(tSummary[応募No.],【様式１】b!H:H,0)),\"\")","v":"◇◇　◇◇"},{"$f":"IFERROR(INDEX(【様式１】b!X:X,MATCH(tSummary[応募No.],【様式１】b!H:H,0)),\"\")","v":"メディア芸術"},{"$f":"IFERROR(INDEX(【様式１】b!Y:Y,MATCH(tSummary[応募No.],【様式１】b!H:H,0)),\"\")","v":"A　メディアアート"},{"$f":"IFERROR(INDEX(【様式１】b!CN:CN,MATCH(tSummary[応募No.],【様式１】b!H:H,0)),0)","v":1},{"$f":"IFERROR(INDEX(【様式１】b!ER:ER,MATCH(tSummary[応募No.],【様式１】b!H:H,0)),0)","v":2},{"$f":"IFERROR(INDEX(【様式１】b!GV:GV,MATCH(tSummary[応募No.],【様式１】b!H:H,0)),0)","v":2},5,{"$f":"IFERROR(INDEX(【様式１】b!GY:GY,MATCH(tSummary[応募No.],【様式１】b!H:H,0)),0)","v":97300},{"$f":"IFERROR(INDEX(【様式１】b!GZ:GZ,MATCH(tSummary[応募No.],【様式１】b!H:H,0)),0)","v":65590},{"$f":"IFERROR(INDEX(【様式１】b!HA:HA,MATCH(tSummary[応募No.],【様式１】b!H:H,0)),0)","v":48700},211590]
[5,1,{"$f":"IFERROR(INDEX(【様式１】b!J:J,MATCH(【様式１】実施希望調書!A13,【様式１】b!H:H,0)),\"\")","v":"○○県立○○高等学校"},{"$f":"IFERROR(INDEX(【様式１】b!AA:AA,MATCH(tSummary[応募No.],【様式１】b!H:H,0)),\"\")","v":3},{"$f":"IF(LEN(INDEX(【様式１】b!AM:AM,MATCH(tSummary[応募No.],【様式１】b!H:H,0)))=0,\"\",INDEX(【様式１】b!AM:AM,MATCH(tSummary[応募No.],【様式１】b!H:H,0)))","v":"2022-10-02"},{"$f":"IF(LEN(INDEX(【様式１】b!CQ:CQ,MATCH(tSummary[応募No.],【様式１】b!H:H,0)))=0,\"\",INDEX(【様式１】b!CQ:CQ,MATCH(tSummary[応募No.],【様式１】b!H:H,0)))","v":"2022-11-11"},{"$f":"IF(LEN(INDEX(【様式１】b!EU:EU,MATCH(tSummary[応募No.],【様式１】b!H:H,0)))=0,\"\",INDEX(【様式１】b!EU:EU,MATCH(tSummary[応募No.],【様式１】b!H:H,0)))","v":"2022-12-04"},{"$f":"IFERROR(INDEX(【様式１】b!AB:AB,MATCH(tSummary[応募No.],【様式１】b!H:H,0)),\"\")","v":"芸術　花子"},{"$f":"IFERROR(INDEX(【様式１】b!X:X,MATCH(tSummary[応募No.],【様式１】b!H:H,0)),\"\")","v":"音楽"},{"$f":"IFERROR(INDEX(【様式１】b!Y:Y,MATCH(tSummary[応募No.],【様式１】b!H:H,0)),\"\")","v":"C　弦楽器"},{"$f":"IFERROR(INDEX(【様式１】b!CN:CN,MATCH(tSummary[応募No.],【様式１】b!H:H,0)),0)","v":0},{"$f":"IFERROR(INDEX(【様式１】b!ER:ER,MATCH(tSummary[応募No.],【様式１】b!H:H,0)),0)","v":0},{"$f":"IFERROR(INDEX(【様式１】b!GV:GV,MATCH(tSummary[応募No.],【様式１】b!H:H,0)),0)","v":0},0,{"$f":"IFERROR(INDEX(【様式１】b!GY:GY,MATCH(tSummary[応募No.],【様式１】b!H:H,0)),0)","v":106950},{"$f":"IFERROR(INDEX(【様式１】b!GZ:GZ,MATCH(tSummary[応募No.],【様式１】b!H:H,0)),0)","v":1500},{"$f":"IFERROR(INDEX(【様式１】b!HA:HA,MATCH(tSummary[応募No.],【様式１】b!H:H,0)),0)","v":48700},157150,null,"○",null,null,null,"過去4年採択実績がないため優先して採択を希望。"]
["　　計",null,null,null,null,null,null,null,null,null,null,null,null,null,{"$f":"SUM(tSummary[謝金])","v":771800},{"$f":"SUM(tSummary[旅費])","v":141930},{"$f":"SUM(tSummary[講演等諸雑費])","v":203700},{"$f":"SUM(tSummary[合計])","v":1117430}]
["※域内において推薦順位を指定する場合は推薦順位を入力してください。推薦順位が特にない場合は空欄のままとしてください。"]
["※　「過疎地域自立促進特別措置法」、「山村振興法」、「離島振興法」、「半島振興法」、「奄美群島振興開発特別措置法」、"]
["\n　 　「小笠原諸島振興開発特別措置法」の定める地域に該当する場合は、「過疎」、「山村」、「離島」、「半島」、「奄美・小笠原」欄に○印をつけてください。"]
["※本事業で得た個人情報は、本事業内のみで使用します"]
["※本事業の専用ウェブページにある[個人情報について]に同意していただいたものとします"]

{"sheet":"Footer","index":2,"n_rows":6,"n_cols":1,"rows_kept":6,"cut":false,"hidden":true,"merged":[[0,0,0,13],[0,18,0,22]]}
["　　計"]
["※域内において推薦順位を指定する場合は推薦順位を入力してください。推薦順位が特にない場合は空欄のままとしてください。"]
["※　「過疎地域自立促進特別措置法」、「山村振興法」、「離島振興法」、「半島振興法」、「奄美群島振興開発特別措置法」、"]
["\n　 　「小笠原諸島振興開発特別措置法」の定める地域に該当する場合は、「過疎」、「山村」、「離島」、「半島」、「奄美・小笠原」欄に○印をつけてください。"]
["※本事業で得た個人情報は、本事業内のみで使用します"]
["※本事業の専用ウェブページにある[個人情報について]に同意していただいたものとします"]

{"sheet":"【様式１】b","index":3,"n_rows":6,"n_cols":216,"rows_kept":6,"cut":false,"hidden":true,"merged":[]}
[null,"都道府県名","都道府県担当部局","都道府県担当者氏名","都道府県TEL","都道府県FAX","都道府県メール","応募No.","推薦\n順位","実施希望校","実施希望校ふりがな","全校児童生徒","所在地郵便番号前","実施校所在地郵便番号後","実施校所在地都道府県","実施校所在地住所","実施校学校長名","実施校担当者名","実施校TEL","実施校FAX","実施校メール","実施会場","合同開催","実施分野大項目","実施分野中項目","実施分野補足","実施\n回数","講師氏名","講師氏名ふりがな","所属団体","学校との関係","学校との関係その他","協力者名簿","連続実施年数同一講師","連続実施年数同一分野","連続実施確認１","連続実施理由項目","連続実施理由詳細","実施日第1回","実施時間1回目","実施合計1回目","連続する実施1回目","連続都道府県1回目","連続学校名1回目","教科の位置付け1回目","教科の位置付け詳細1回目","著作権1回目","著作権許諾取得有無1回目","参加児童生徒数1回目","参加児童生徒単位1回目","参加児童生徒単位詳細1回目","補助者①氏名1回目","補助者①演奏時間1回目","補助者①実技時間1回目","補助者①単労時間1回目","補助者①謝金合計1回目","補助者②氏名1回目","補助者②演奏時間1回目","補助者②実技時間1回目","補助者②単労時間1回目","補助者②謝金合計1回目","補助者③氏名1回目","補助者③演奏時間1回目","補助者③実技時間1回目","補助者③単労時間1回目","補助者③謝金合計1回目","補助者④氏名1回目","補助者④演奏時間1回目","補助者④実技時間1回目","補助者④単労時間1回目","補助者④謝金合計1回目","補助者⑤氏名1回目","補助者⑤演奏時間1回目","補助者⑤実技時間1回目","補助者⑤単労時間1回目","補助者⑤謝金合計1回目","補助者⑥氏名1回目","補助者⑥演奏時間1回目","補助者⑥実技時間1回目","補助者⑥単労時間1回目","補助者⑥謝金合計1回目","補助者⑦氏名1回目","補助者⑦演奏時間1回目","補助者⑦実技時間1回目","補助者⑦単労時間1回目","補助者⑦謝金合計1回目","補助者⑧氏名1回目","補助者⑧演奏時間1回目","補助者⑧実技時間1回目","補助者⑧単労時間1回目","補助者⑧謝金合計1回目","1回目補助者人数","1回目謝金合計","事業内容1回目","実施日第2回","実施時間2回目","実施合計2回目","連続する実施2回目","連続都道府県2回目","連続学校名2回目","教科の位置付け2回目","教科の位置付け詳細2回目","著作権2回目","著作権許諾取得有無2回目","参加児童生徒数2回目","参加児童生徒単位2回目","参加児童生徒単位詳細2回目","補助者①氏名2回目","補助者①演奏時間2回目","補助者①実技時間2回目","補助者①単労時間2回目","補助者①謝金合計2回目","補助者②氏名2回目","補助者②演奏時間2回目","補助者②実技時間2回目","補助者②単労時間2回目","補助者②謝金合計2回目","補助者③氏名2回目","補助者③演奏時間2回目","補助者③実技時間2回目","補助者③単労時間2回目","補助者③謝金合計2回目","補助者④氏名2回目","補助者④演奏時間2回目","補助者④実技時間2回目","補助者④単労時間2回目","補助者④謝金合計2回目","補助者⑤氏名2回目","補助者⑤演奏時間2回目","補助者⑤実技時間2回目","補助者⑤単労時間2回目","補助者⑤謝金合計2回目","補助者⑥氏名2回目","補助者⑥演奏時間2回目","補助者⑥実技時間2回目","補助者⑥単労時間2回目","補助者⑥謝金合計2回目","補助者⑦氏名2回目","補助者⑦演奏時間2回目","補助者⑦実技時間2回目","補助者⑦単労時間2回目","補助者⑦謝金合計2回目","補助者⑧氏名2回目","補助者⑧演奏時間2回目","補助者⑧実技時間2回目","補助者⑧単労時間2回目","補助者⑧謝金合計2回目","2回目補助者人数","2回目謝金合計","事業内容2回目","実施日第3回","実施時間3回目","実施合計3回目","連続する実施3回目","連続都道府県3回目","連続学校名3回目","教科の位置付け3回目","教科の位置付け詳細3回目","著作権3回目","著作権許諾取得有無3回目","参加児童生徒数3回目","参加児童生徒単位3回目","参加児童生徒単位詳細3回目","補助者①氏名3回目","補助者①演奏時間3回目","補助者①実技時間3回目","補助者①単労時間3回目","補助者①謝金合計3回目","補助者②氏名3回目","補助者②演奏時間3回目","補助者②実技時間3回目","補助者②単労時間3回目","補助者②謝金合計3回目","補助者③氏名3回目","補助者③演奏時間3回目","補助者③実技時間3回目","補助者③単労時間3回目","補助者③謝金合計3回目","補助者④氏名3回目","補助者④演奏時間3回目","補助者④実技時間3回目","補助者④単労時間3回目","補助者④謝金合計3回目","補助者⑤氏名3回目","補助者⑤演奏時間3回目","補助者⑤実技時間3回目","補助者⑤単労時間3回目","補助者⑤謝金合計3回目","補助者⑥氏名3回目","補助者⑥演奏時間3回目","補助者⑥実技時間3回目","補助者⑥単労時間3回目","補助者⑥謝金合計3回目","補助者⑦氏名3回目","補助者⑦演奏時間3回目","補助者⑦実技時間3回目","補助者⑦単労時間3回目","補助者⑦謝金合計3回目","補助者⑧氏名3回目","補助者⑧演奏時間3回目","補助者⑧実技時間3回目","補助者⑧単労時間3回目","補助者⑧謝金合計3回目","3回目補助者人数","3回目謝金合計","事業内容3回目","謝金","旅費","講演等\n諸雑費","合計","過疎","山村","離島","半島","奄美／\n小笠原","備考"]
[null,null,null,null,null,null,null,1,null,"○○市立文化小学校","○○しりつ　ぶんか　しょうがっこう",300,"***","****","北海道","○○市　△△　1-1-1","◇◇　◇◇","□□　□□","00-0000-0000","00-0000-1111","xxx@xxxx.xx.xx","実施校の教室・体育館","なし","音楽","C　弦楽器",null,3,"芸術　花子","げいじゅつ　はなこ","●●室内管弦楽団","卒業生",null,"登録済み",2,4,"確認済み","希望する講師が芸術分野以外にも申請校が求める専門スキルを所有しており他の講師での実施が困難（福祉現場での活動経験が豊富等）","本校では毎年、芸術文化の鑑賞や活動体験を通して、子供たちの豊かな情操を育み、芸術に親しむ感性を養うことを目的として芸術家の派遣事業を活用している。本校の児童の特性として、発達に困難を抱えた児童が多く、毎年異なる講師を迎えることは、子供たちへ不安や緊張といったストレスをかける要因となり、本来の目的達成に支障が生じてしまう。本校が希望する○○先生は本校の児童の特性に深く理解があり、教員側・保護者側からも安心して実施をお任せできることから、令和4年度も継続して○○先生を講師に迎えることを希望する。","2022-06-10","午前",90,"有","北海道","◎◎市立芸術中学校","教科","音楽","許諾が必要","許諾取得済み",100,"学年単位","5，6年生","次代　太郎",1,1,null,11720,"音楽　花子",1,1,null,11720,"演奏　太郎",1,1,null,11720,null,null,null,null,0,null,null,null,null,0,null,null,null,null,0,null,null,null,null,0,null,null,null,null,0,3,35160,"○○○○○○○○○○○○○○○○○○○○○○○○○○○○○○○○○○○○○○○○○○○○○○○○○○○○○○○○○○○○○○○○○○○○○○○○○○○○○○○○○○○○○○○○○○○○○○○○○○○○○○○○○○○○○○○○○○○○○○○○○○○○○○○○○○○○○○○○○○○○○○○○○○○○○○○○○○○○○○○○○○○○○○○○○○○○","2022-06-17","午後",150,"無",null,null,"総合的な学習の時間",null,"許諾は不要",null,100,"学年単位","5，6年生","次代　太郎",2,1,null,18240,"音楽　花子",2,1,null,18240,"演奏　太郎",2,1,null,18240,null,null,null,null,0,null,null,null,null,0,null,null,null,null,0,null,null,null,null,0,null,null,null,null,0,3,54720,"○○○○○○○○○○○○○○○○○○○○○○○○○○○○○○○○○○○○○○○○○○○○○○○○○○○○○○○○○○○○○○○○○○○○○○○○○○○○○○○○○○○○○○○○○○○○○○○○○○○○○○○○○○○○○○○○○○○○○○○○○○○○○○○○○○○○○○○○○○○○○○○○○○○○○○○○○○○○○○○○○○○○○○○○○○○○","2022-06-23","午前と午後",150,"無",null,null,"特別活動","文化的行事","許諾が必要","許諾未取得",300,"全校児童/生徒",null,"次代　太郎",2,1,null,18240,"音楽　花子",2,null,null,13040,"演奏　太郎",2,null,null,13040,"弦楽　花子",2,null,null,13040,"鍵盤　太郎",2,null,null,13040,null,null,null,null,0,null,null,null,null,0,null,null,null,null,0,5,70400,"○○○○○○○○○○○○○○○○○○○○○○○○○○○○○○○○○○○○○○○○○○○○○○○○○○○○○○○○○○○○○○○○○○○○○○○○○○○○○○○○○○○○○○○○○○○○○○○○○○○○○○○○○○○○○○○○○○○○○○○○○○○○○○○○○○○○○○○○○○○○○○○○○○○○○○○○○○○○○○○○○○○○○○○○○○○○",267230,65590,48700,381520]
[null,null,null,null,null,null,null,2,null,"△△市立△△小学校","○○しりつ　ぶんか　しょうがっこう",300,"***","****","北海道","○○市　△△　1-1-1","◇◇　◇◇","□□　□□","00-0000-0000","00-0000-1111","xxx@xxxx.xx.xx","実施校の教室・体育館","なし","音楽","D　パーカッション",null,1,"◎◎　◎◎","げいじゅつ　はなこ","●●室内管弦楽団","卒業生",null,"登録済み",2,4,"確認済み","希望する講師が芸術分野以外にも申請校が求める専門スキルを所有しており他の講師での実施が困難（福祉現場での活動経験が豊富等）","本校では毎年、芸術文化の鑑賞や活動体験を通して、子供たちの豊かな情操を育み、芸術に親しむ感性を養うことを目的として芸術家の派遣事業を活用している。本校の児童の特性として、発達に困難を抱えた児童が多く、毎年異なる講師を迎えることは、子供たちへ不安や緊張といったストレスをかける要因となり、本来の目的達成に支障が生じてしまう。本校が希望する○○先生は本校の児童の特性に深く理解があり、教員側・保護者側からも安心して実施をお任せできることから、令和4年度も継続して○○先生を講師に迎えることを希望する。","2022-07-01","午前",90,"有","北海道","◎◎市立芸術中学校","教科","音楽","許諾が必要","許諾取得済み",100,"学年単位","5，6年生","次代　太郎",3,null,null,19560,"音楽　花子",3,null,null,19560,"演奏　太郎",3,null,null,19560,"ああ　ああ",3,null,null,19560,"いい　いい",3,null,null,19560,null,null,null,null,0,null,null,null,null,0,null,null,null,null,0,5,97800,"○○○○○○○○○○○○○○○○○○○○○○○○○○○○○○○○○○○○○○○○○○○○○○○○○○○○○○○○○○○○○○○○○○○○○○○○○○○○○○○○○○○○○○○○○○○○○○○○○○○○○○○○○○○○○○○○○○○○○○○○○○○○○○○○○○○○○○○○○○○○○○○○○○○○○○○○○○○○○○○○○○○○○○○○○○○○",null,null,null,null,null,null,null,null,null,null,null,null,null,null,null,null,null,0,null,null,null,null,0,null,null,null,null,0,null,null,null,null,0,null,null,null,null,0,null,null,null,null,0,null,null,null,null,0,null,null,null,null,0,0,0,"○○○○○○○○○○○○○○○○○○○○○○○○○○○○○○○○○○○○○○○○○○○○○○○○○○○○○○○○○○○○○○○○○○○○○○○○○○○○○○○○○○○○○○○○○○○○○○○○○○○○○○○○○○○○○○○○○○○○○○○○○○○○○○○○○○○○○○○○○○○○○○○○○○○○○○○○○○○○○○○○○○○○○○○○○○○○",null,null,null,null,null,null,null,null,null,null,null,null,null,null,null,null,null,0,null,null,null,null,0,null,null,null,null,0,null,null,null,null,0,null,null,null,null,0,null,null,null,null,0,null,null,null,null,0,null,null,null,null,0,0,0,"○○○○○○○○○○○○○○○○○○○○○○○○○○○○○○○○○○○○○○○○○○○○○○○○○○○○○○○○○○○○○○○○○○○○○○○○○○○○○○○○○○○○○○○○○○○○○○○○○○○○○○○○○○○○○○○○○○○○○○○○○○○○○○○○○○○○○○○○○○○○○○○○○○○○○○○○○○○○○○○○○○○○○○○○○○○○",133450,3000,27600,164050]
[null,null,null,null,null,null,null,3,null,"△△市立△△中学校","○○しりつ　ぶんか　しょうがっこう",300,"***","****","北海道","○○市　△△　1-1-1","◇◇　◇◇","□□　□□","00-0000-0000","00-0000-1111","xxx@xxxx.xx.xx","実施校の教室・体育館","なし","文学","A　俳句",null,3,"□□　□□","げいじゅつ　はなこ","●●室内管弦楽団","卒業生",null,"登録済み",2,4,"確認済み","希望する講師が芸術分野以外にも申請校が求める専門スキルを所有しており他の講師での実施が困難（福祉現場での活動経験が豊富等）","本校では毎年、芸術文化の鑑賞や活動体験を通して、子供たちの豊かな情操を育み、芸術に親しむ感性を養うことを目的として芸術家の派遣事業を活用している。本校の児童の特性として、発達に困難を抱えた児童が多く、毎年異なる講師を迎えることは、子供たちへ不安や緊張といったストレスをかける要因となり、本来の目的達成に支障が生じてしまう。本校が希望する○○先生は本校の児童の特性に深く理解があり、教員側・保護者側からも安心して実施をお任せできることから、令和4年度も継続して○○先生を講師に迎えることを希望する。","2022-06-03","午前",90,"有","北海道","◎◎市立芸術中学校","教科","音楽","許諾が必要","許諾取得済み",100,"学年単位","5，6年生","次代　太郎",1,1,null,11720,"音楽　花子",1,1,null,11720,null,null,null,null,0,null,null,null,null,0,null,null,null,null,0,null,null,null,null,0,null,null,null,null,0,null,null,null,null,0,2,23440,"○○○○○○○○○○○○○○○○○○○○○○○○○○○○○○○○○○○○○○○○○○○○○○○○○○○○○○○○○○○○○○○○○○○○○○○○○○○○○○○○○○○○○○○○○○○○○○○○○○○○○○○○○○○○○○○○○○○○○○○○○○○○○○○○○○○○○○○○○○○○○○○○○○○○○○○○○○○○○○○○○○○○○○○○○○○○","2022-06-12","午後",150,"無",null,null,"総合的な学習の時間",null,"許諾は不要",null,100,"学年単位","5，6年生","次代　太郎",2,1,null,18240,null,null,null,null,0,null,null,null,null,0,null,null,null,null,0,null,null,null,null,0,null,null,null,null,0,null,null,null,null,0,null,null,null,null,0,1,18240,"○○○○○○○○○○○○○○○○○○○○○○○○○○○○○○○○○○○○○○○○○○○○○○○○○○○○○○○○○○○○○○○○○○○○○○○○○○○○○○○○○○○○○○○○○○○○○○○○○○○○○○○○○○○○○○○○○○○○○○○○○○○○○○○○○○○○○○○○○○○○○○○○○○○○○○○○○○○○○○○○○○○○○○○○○○○○","2022-07-14","午前と午後",150,"無",null,null,"特別活動","文化的行事","許諾が必要","許諾未取得",300,"全校児童/生徒",null,"次代　太郎",2,1,null,18240,null,null,null,null,0,null,null,null,null,0,null,null,null,null,0,null,null,null,null,0,null,null,null,null,0,null,null,null,null,0,null,null,null,null,0,1,18240,"○○○○○○○○○○○○○○○○○○○○○○○○○○○○○○○○○○○○○○○○○○○○○○○○○○○○○○○○○○○○○○○○○○○○○○○○○○○○○○○○○○○○○○○○○○○○○○○○○○○○○○○○○○○○○○○○○○○○○○○○○○○○○○○○○○○○○○○○○○○○○○○○○○○○○○○○○○○○○○○○○○○○○○○○○○○○",166870,6250,30000,203120]
[null,null,null,null,null,null,null,4,null,"○○市立○○中学校","○○しりつ　ぶんか　しょうがっこう",300,"***","****","北海道","○○市　△△　1-1-1","◇◇　◇◇","□□　□□","00-0000-0000","00-0000-1111","xxx@xxxx.xx.xx","実施校の教室・体育館","なし","メディア芸術","A　メディアアート",null,2,"◇◇　◇◇","げいじゅつ　はなこ","●●室内管弦楽団","卒業生",null,"登録済み",2,4,"確認済み","希望する講師が芸術分野以外にも申請校が求める専門スキルを所有しており他の講師での実施が困難（福祉現場での活動経験が豊富等）","本校では毎年、芸術文化の鑑賞や活動体験を通して、子供たちの豊かな情操を育み、芸術に親しむ感性を養うことを目的として芸術家の派遣事業を活用している。本校の児童の特性として、発達に困難を抱えた児童が多く、毎年異なる講師を迎えることは、子供たちへ不安や緊張といったストレスをかける要因となり、本来の目的達成に支障が生じてしまう。本校が希望する○○先生は本校の児童の特性に深く理解があり、教員側・保護者側からも安心して実施をお任せできることから、令和4年度も継続して○○先生を講師に迎えることを希望する。","2022-06-10","午前",90,"有","北海道","◎◎市立芸術中学校","教科","音楽","許諾が必要","許諾取得済み",100,"学年単位","5，6年生","次代　太郎",null,2,null,10400,null,null,null,null,0,null,null,null,null,0,null,null,null,null,0,null,null,null,null,0,null,null,null,null,0,null,null,null,null,0,null,null,null,null,0,1,10400,"○○○○○○○○○○○○○○○○○○○○○○○○○○○○○○○○○○○○○○○○○○○○○○○○○○○○○○○○○○○○○○○○○○○○○○○○○○○○○○○○○○○○○○○○○○○○○○○○○○○○○○○○○○○○○○○○○○○○○○○○○○○○○○○○○○○○○○○○○○○○○○○○○○○○○○○○○○○○○○○○○○○○○○○○○○○○","2022-06-17","午後",150,"無",null,null,"総合的な学習の時間",null,"許諾は不要",null,100,"学年単位","5，6年生","次代　太郎",null,3,null,15600,"メディア　花子",null,3,null,15600,null,null,null,null,0,null,null,null,null,0,null,null,null,null,0,null,null,null,null,0,null,null,null,null,0,null,null,null,null,0,2,31200,"○○○○○○○○○○○○○○○○○○○○○○○○○○○○○○○○○○○○○○○○○○○○○○○○○○○○○○○○○○○○○○○○○○○○○○○○○○○○○○○○○○○○○○○○○○○○○○○○○○○○○○○○○○○○○○○○○○○○○○○○○○○○○○○○○○○○○○○○○○○○○○○○○○○○○○○○○○○○○○○○○○○○○○○○○○○○",null,null,null,"無",null,null,null,null,null,"許諾未取得",null,null,null,null,null,null,null,0,null,null,null,null,0,null,null,null,null,0,"弦楽　花子",null,null,null,0,"鍵盤　太郎",null,null,null,0,null,null,null,null,0,null,null,null,null,0,null,null,null,null,0,2,0,null,97300,65590,48700,211590]
[null,null,null,null,null,null,null,5,null,"○○県立○○高等学校","○○しりつ　ぶんか　しょうがっこう",300,"***","****","北海道","○○市　△△　1-1-1","◇◇　◇◇","□□　□□","00-0000-0000","00-0000-1111","xxx@xxxx.xx.xx","実施校の教室・体育館","なし","音楽","C　弦楽器",null,3,"芸術　花子","げいじゅつ　はなこ","●●室内管弦楽団","卒業生",null,"登録済み",2,4,"確認済み","希望する講師が芸術分野以外にも申請校が求める専門スキルを所有しており他の講師での実施が困難（福祉現場での活動経験が豊富等）","本校では毎年、芸術文化の鑑賞や活動体験を通して、子供たちの豊かな情操を育み、芸術に親しむ感性を養うことを目的として芸術家の派遣事業を活用している。本校の児童の特性として、発達に困難を抱えた児童が多く、毎年異なる講師を迎えることは、子供たちへ不安や緊張といったストレスをかける要因となり、本来の目的達成に支障が生じてしまう。本校が希望する○○先生は本校の児童の特性に深く理解があり、教員側・保護者側からも安心して実施をお任せできることから、令和4年度も継続して○○先生を講師に迎えることを希望する。","2022-10-02","午前",90,"有","北海道","◎◎市立芸術中学校","教科","音楽","許諾が必要","許諾取得済み",100,"学年単位","5，6年生",null,null,null,null,0,null,null,null,null,0,null,null,null,null,0,null,null,null,null,0,null,null,null,null,0,null,null,null,null,0,null,null,null,null,0,null,null,null,null,0,0,0,"○○○○○○○○○○○○○○○○○○○○○○○○○○○○○○○○○○○○○○○○○○○○○○○○○○○○○○○○○○○○○○○○○○○○○○○○○○○○○○○○○○○○○○○○○○○○○○○○○○○○○○○○○○○○○○○○○○○○○○○○○○○○○○○○○○○○○○○○○○○○○○○○○○○○○○○○○○○○○○○○○○○○○○○○○○○○","2022-11-11","午後",150,"無",null,null,"総合的な学習の時間",null,"許諾は不要",null,100,"学年単位","5，6年生",null,null,null,null,0,null,null,null,null,0,null,null,null,null,0,null,null,null,null,0,null,null,null,null,0,null,null,null,null,0,null,null,null,null,0,null,null,null,null,0,0,0,"○○○○○○○○○○○○○○○○○○○○○○○○○○○○○○○○○○○○○○○○○○○○○○○○○○○○○○○○○○○○○○○○○○○○○○○○○○○○○○○○○○○○○○○○○○○○○○○○○○○○○○○○○○○○○○○○○○○○○○○○○○○○○○○○○○○○○○○○○○○○○○○○○○○○○○○○○○○○○○○○○○○○○○○○○○○○","2022-12-04","午前と午後",150,"無",null,null,"特別活動","文化的行事","許諾が必要","許諾未取得",300,"全校児童/生徒",null,null,null,null,null,0,null,null,null,null,0,null,null,null,null,0,null,null,null,null,0,null,null,null,null,0,null,null,null,null,0,null,null,null,null,0,null,null,null,null,0,0,0,"○○○○○○○○○○○○○○○○○○○○○○○○○○○○○○○○○○○○○○○○○○○○○○○○○○○○○○○○○○○○○○○○○○○○○○○○○○○○○○○○○○○○○○○○○○○○○○○○○○○○○○○○○○○○○○○○○○○○○○○○○○○○○○○○○○○○○○○○○○○○○○○○○○○○○○○○○○○○○○○○○○○○○○○○○○○○",106950,1500,48700,157150]

{"sheet":"Sheet1","index":4,"n_rows":201,"n_cols":10,"rows_kept":201,"cut":false,"hidden":true,"merged":[]}
["実施希望校","【様式２・３】実施希望調書!E7",null,"実施希望校","【様式２・３】実施希望調書!E7",null,{"$f":"EXACT(A1,D1)","v":true},null,null,"【様式２・３】実施希望調書!E7"]
["実施希望校ふりがな","【様式２・３】実施希望調書!E6",null,"実施希望校ふりがな","【様式２・３】実施希望調書!E6",null,{"$f":"EXACT(A2,D2)","v":true},null,null,"【様式２・３】実施希望調書!E6"]
["全校児童生徒","【様式２・３】実施希望調書!W6",null,"全校児童生徒","【様式２・３】実施希望調書!W6",null,true,null,null,"【様式２・３】実施希望調書!W6"]
["所在地郵便番号前","【様式２・３】実施希望調書!F8",null,"所在地郵便番号前","【様式２・３】実施希望調書!F8",null,true,null,null,"【様式２・３】実施希望調書!F8"]
["実施校所在地郵便番号後","【様式２・３】実施希望調書!J8",null,"実施校所在地郵便番号後","【様式２・３】実施希望調書!J8",null,true,null,null,"【様式２・３】実施希望調書!J8"]
["実施校所在地都道府県","【様式２・３】実施希望調書!P8",null,"実施校所在地都道府県","【様式２・３】実施希望調書!P8",null,true,null,null,"【様式２・３】実施希望調書!P8"]
["実施校所在地住所","【様式２・３】実施希望調書!E9",null,"実施校所在地住所","【様式２・３】実施希望調書!E9",null,true,null,null,"【様式２・３】実施希望調書!E9"]
["実施校学校長名","【様式２・３】実施希望調書!W8",null,"実施校学校長名","【様式２・３】実施希望調書!W8",null,true,null,null,"【様式２・３】実施希望調書!W8"]
["実施校担当者名","【様式２・３】実施希望調書!W9",null,"実施校担当者名","【様式２・３】実施希望調書!W9",null,true,null,null,"【様式２・３】実施希望調書!W9"]
["実施校TEL","【様式２・３】実施希望調書!W10",null,"実施校TEL","【様式２・３】実施希望調書!E10",null,true,null,null,"【様式２・３】実施希望調書!W10"]
["実施校FAX","【様式２・３】実施希望調書!N10",null,"実施校FAX","【様式２・３】実施希望調書!N10",null,true,null,null,"【様式２・３】実施希望調書!N10"]
["実施校メール","【様式２・３】実施希望調書!W11",null,"実施校メール","【様式２・３】実施希望調書!W10",null,true,null,null,"【様式２・３】実施希望調書!W11"]
["実施会場","【様式２・３】実施希望調書!E10",null,"実施会場","【様式２・３】実施希望調書!E10",null,true,null,null,"【様式２・３】実施希望調書!E10"]
["合同開催","【様式２・３】実施希望調書!H11",null,"合同開催","【様式２・３】実施希望調書!H11",null,true,null,null,"【様式２・３】実施希望調書!H11"]
["実施分野大項目","【様式２・３】実施希望調書!E13",null,"実施分野大項目","【様式２・３】実施希望調書!E13",null,true,null,null,"【様式２・３】実施希望調書!E13"]
["実施分野中項目","【様式２・３】実施希望調書!I13",null,"実施分野中項目","【様式２・３】実施希望調書!I13",null,true,null,null,"【様式２・３】実施希望調書!I13"]
["実施分野補足","【様式２・３】実施希望調書!M13",null,"実施分野補足","【様式２・３】実施希望調書!M13",null,true,null,null,"【様式２・３】実施希望調書!M13"]
["実施\n回数","【様式２・３】実施希望調書!F14",null,"実施\n回数","【様式２・３】実施希望調書!F14",null,true,null,null,"【様式２・３】実施希望調書!F14"]
["講師氏名","【様式２・３】実施希望調書!E16",null,"講師氏名","【様式２・３】実施希望調書!E16",null,true,null,null,"【様式２・３】実施希望調書!E16"]
["講師氏名ふりがな","【様式２・３】実施希望調書!E15",null,"講師氏名ふりがな","【様式２・３】実施希望調書!E15",null,true,null,null,"【様式２・３】実施希望調書!E15"]
["所属団体","【様式２・３】実施希望調書!W15",null,"所属団体","【様式２・３】実施希望調書!W15",null,true,null,null,"【様式２・３】実施希望調書!W15"]
["学校との関係","【様式２・３】実施希望調書!E17",null,"学校との関係","【様式２・３】実施希望調書!E17",null,true,null,null,"【様式２・３】実施希望調書!E17"]
["学校との関係その他","【様式２・３】実施希望調書!S17",null,"学校との関係その他","【様式２・３】実施希望調書!S17",null,true,null,null,"【様式２・３】実施希望調書!S17"]
["協力者名簿","【様式２・３】実施希望調書!E18",null,"協力者名簿","【様式２・３】実施希望調書!E18",null,true,null,null,"【様式２・３】実施希望調書!E18"]
["連続実施年数同一講師","【様式２・３】実施希望調書!U18",null,"連続実施年数同一講師","【様式２・３】実施希望調書!U18",null,true,null,null,"【様式２・３】実施希望調書!U18"]
["連続実施年数同一分野","【様式２・３】実施希望調書!AA18",null,"連続実施年数同一分野","【様式２・３】実施希望調書!AA18",null,true,null,null,"【様式２・３】実施希望調書!AA18"]
["連続実施確認１","【様式２・３】実施希望調書!AB20",null,"連続実施確認１","【様式２・３】実施希望調書!AB20",null,true,null,null,"【様式２・３】実施希望調書!AB20"]
["連続実施理由項目","【様式２・３】実施希望調書!E22",null,"連続実施理由項目","【様式２・３】実施希望調書!E22",null,true,null,null,"【様式２・３】実施希望調書!E22"]
["連続実施理由詳細","【様式２・３】実施希望調書!E24",null,"連続実施理由詳細","【様式２・３】実施希望調書!E24",null,true,null,null,"【様式２・３】実施希望調書!E24"]
["実施日第1回","【様式２・３】実施希望調書!E25",null,"実施日第1回","【様式２・３】実施希望調書!E25",null,true,null,null,"【様式２・３】実施希望調書!E25"]
["実施時間1回目","【様式２・３】実施希望調書!S25",null,"実施時間1回目","【様式２・３】実施希望調書!S25",null,true,null,null,"【様式２・３】実施希望調書!S25"]
["実施合計1回目","【様式２・３】実施希望調書!AA25",null,"実施合計1回目","【様式２・３】実施希望調書!AA25",null,true,null,null,"【様式２・３】実施希望調書!AA25"]
["連続する実施1回目","【様式２・３】実施希望調書!E26",null,"連続する実施1回目","【様式２・３】実施希望調書!E26",null,true,null,null,"【様式２・３】実施希望調書!E26"]
["連続都道府県1回目","【様式２・３】実施希望調書!O26",null,"連続都道府県1回目","【様式２・３】実施希望調書!O26",null,true,null,null,"【様式２・３】実施希望調書!O26"]
["連続学校名1回目","【様式２・３】実施希望調書!V26",null,"連続学校名1回目","【様式２・３】実施希望調書!V26",null,true,null,null,"【様式２・３】実施希望調書!V26"]
["教科の位置付け1回目","【様式２・３】実施希望調書!E27",null,"教科の位置付け1回目","【様式２・３】実施希望調書!E27",null,true,null,null,"【様式２・３】実施希望調書!E27"]
["教科の位置付け詳細1回目","【様式２・３】実施希望調書!S27",null,"教科の位置付け詳細1回目","【様式２・３】実施希望調書!S27",null,true,null,null,"【様式２・３】実施希望調書!S27"]
["著作権1回目","【様式２・３】実施希望調書!E28",null,"著作権1回目","【様式２・３】実施希望調書!E28",null,true,null,null,"【様式２・３】実施希望調書!E28"]
["著作権許諾取得有無1回目","【様式２・３】実施希望調書!V28",null,"著作権許諾取得有無1回目","【様式２・３】実施希望調書!V28",null,true,null,null,"【様式２・３】実施希望調書!V28"]
["参加児童生徒数1回目","【様式２・３】実施希望調書!G29",null,"参加児童生徒数1回目","【様式２・３】実施希望調書!G29",null,true,null,null,"【様式２・３】実施希望調書!G29"]
["参加児童生徒単位1回目","【様式２・３】実施希望調書!P29",null,"参加児童生徒単位1回目","【様式２・３】実施希望調書!P29",null,true,null,null,"【様式２・３】実施希望調書!P29"]
["参加児童生徒単位詳細1回目","【様式２・３】実施希望調書!S30",null,"参加児童生徒単位詳細1回目","【様式２・３】実施希望調書!S30",null,true,null,null,"【様式２・３】実施希望調書!S30"]
["補助者①氏名1回目","【様式２・３】実施希望調書!F32",null,"補助者①氏名1回目","【様式２・３】実施希望調書!F32",null,true,null,null,"【様式２・３】実施希望調書!F32"]
["補助者①演奏時間1回目","【様式２・３】実施希望調書!N32",null,"補助者①演奏時間1回目","【様式２・３】実施希望調書!N32",null,true,null,null,"【様式２・３】実施希望調書!N32"]
["補助者①実技時間1回目","【様式２・３】実施希望調書!S32",null,"補助者①実技時間1回目","【様式２・３】実施希望調書!S32",null,true,null,null,"【様式２・３】実施希望調書!S32"]
["補助者①単労時間1回目","【様式２・３】実施希望調書!X32",null,"補助者①単労時間1回目","【様式２・３】実施希望調書!X32",null,true,null,null,"【様式２・３】実施希望調書!X32"]
["補助者①謝金合計1回目","【様式２・３】実施希望調書!AA32",null,"補助者①謝金合計1回目","【様式２・３】実施希望調書!AA32",null,true,null,null,"【様式２・３】実施希望調書!AA32"]
["補助者②氏名1回目","【様式２・３】実施希望調書!F33",null,"補助者②氏名1回目","【様式２・３】実施希望調書!F33",null,true,null,null,"【様式２・３】実施希望調書!F33"]
["補助者②演奏時間1回目","【様式２・３】実施希望調書!N33",null,"補助者②演奏時間1回目","【様式２・３】実施希望調書!N33",null,true,null,null,"【様式２・３】実施希望調書!N33"]
["補助者②実技時間1回目","【様式２・３】実施希望調書!S33",null,"補助者②実技時間1回目","【様式２・３】実施希望調書!S33",null,true,null,null,"【様式２・３】実施希望調書!S33"]
["補助者②単労時間1回目","【様式２・３】実施希望調書!X33",null,"補助者②単労時間1回目","【様式２・３】実施希望調書!X33",null,true,null,null,"【様式２・３】実施希望調書!X33"]
["補助者②謝金合計1回目","【様式２・３】実施希望調書!AA33",null,"補助者②謝金合計1回目","【様式２・３】実施希望調書!AA33",null,true,null,null,"【様式２・３】実施希望調書!AA33"]
["補助者③氏名1回目","【様式２・３】実施希望調書!F34",null,"補助者③氏名1回目","【様式２・３】実施希望調書!F34",null,true,null,null,"【様式２・３】実施希望調書!F34"]
["補助者③演奏時間1回目","【様式２・３】実施希望調書!N34",null,"補助者③演奏時間1回目","【様式２・３】実施希望調書!N34",null,true,null,null,"【様式２・３】実施希望調書!N34"]
["補助者③実技時間1回目","【様式２・３】実施希望調書!S34",null,"補助者③実技時間1回目","【様式２・３】実施希望調書!S34",null,true,null,null,"【様式２・３】実施希望調書!S34"]
["補助者③単労時間1回目","【様式２・３】実施希望調書!X34",null,"補助者③単労時間1回目","【様式２・３】実施希望調書!X34",null,true,null,null,"【様式２・３】実施希望調書!X34"]
["補助者③謝金合計1回目","【様式２・３】実施希望調書!AA34",null,"補助者③謝金合計1回目","【様式２・３】実施希望調書!AA34",null,true,null,null,"【様式２・３】実施希望調書!AA34"]
["補助者④氏名1回目","【様式２・３】実施希望調書!F35",null,"補助者④氏名1回目","【様式２・３】実施希望調書!F35",null,true,null,null,"【様式２・３】実施希望調書!F35"]
["補助者④演奏時間1回目","【様式２・３】実施希望調書!N35",null,"補助者④演奏時間1回目","【様式２・３】実施希望調書!N35",null,true,null,null,"【様式２・３】実施希望調書!N35"]
["補助者④実技時間1回目","【様式２・３】実施希望調書!S35",null,"補助者④実技時間1回目","【様式２・３】実施希望調書!S35",null,true,null,null,"【様式２・３】実施希望調書!S35"]
["補助者④単労時間1回目","【様式２・３】実施希望調書!X35",null,"補助者④単労時間1回目","【様式２・３】実施希望調書!X35",null,true,null,null,"【様式２・３】実施希望調書!X35"]
["補助者④謝金合計1回目","【様式２・３】実施希望調書!AA35",null,"補助者④謝金合計1回目","【様式２・３】実施希望調書!AA35",null,true,null,null,"【様式２・３】実施希望調書!AA35"]
["補助者⑤氏名1回目","【様式２・３】実施希望調書!F36",null,"補助者⑤氏名1回目","【様式２・３】実施希望調書!F36",null,true,null,null,"【様式２・３】実施希望調書!F36"]
["補助者⑤演奏時間1回目","【様式２・３】実施希望調書!N36",null,"補助者⑤演奏時間1回目","【様式２・３】実施希望調書!N36",null,true,null,null,"【様式２・３】実施希望調書!N36"]
["補助者⑤実技時間1回目","【様式２・３】実施希望調書!S36",null,"補助者⑤実技時間1回目","【様式２・３】実施希望調書!S36",null,true,null,null,"【様式２・３】実施希望調書!S36"]
["補助者⑤単労時間1回目","【様式２・３】実施希望調書!X36",null,"補助者⑤単労時間1回目","【様式２・３】実施希望調書!X36",null,{"$f":"EXACT(A66,D66)","v":true},null,null,"【様式２・３】実施希望調書!X36"]
["補助者⑤謝金合計1回目","【様式２・３】実施希望調書!AA36",null,"補助者⑤謝金合計1回目","【様式２・３】実施希望調書!AA36",null,true,null,null,"【様式２・３】実施希望調書!AA36"]
["補助者⑥氏名1回目","【様式２・３】実施希望調書!F37",null,"補助者⑥氏名1回目","【様式２・３】実施希望調書!F37",null,true,null,null,"【様式２・３】実施希望調書!F37"]
["補助者⑥演奏時間1回目","【様式２・３】実施希望調書!N37",null,"補助者⑥演奏時間1回目","【様式２・３】実施希望調書!N37",null,true,null,null,"【様式２・３】実施希望調書!N37"]
["補助者⑥実技時間1回目","【様式２・３】実施希望調書!S37",null,"補助者⑥実技時間1回目","【様式２・３】実施希望調書!S37",null,true,null,null,"【様式２・３】実施希望調書!S37"]
["補助者⑥単労時間1回目","【様式２・３】実施希望調書!X37",null,"補助者⑥単労時間1回目","【様式２・３】実施希望調書!X37",null,true,null,null,"【様式２・３】実施希望調書!X37"]
["補助者⑥謝金合計1回目","【様式２・３】実施希望調書!AA37",null,"補助者⑥謝金合計1回目","【様式２・３】実施希望調書!AA37",null,true,null,null,"【様式２・３】実施希望調書!AA37"]
["補助者⑦氏名1回目","【様式２・３】実施希望調書!F38",null,"補助者⑦氏名1回目","【様式２・３】実施希望調書!F38",null,true,null,null,"【様式２・３】実施希望調書!F38"]
["補助者⑦演奏時間1回目","【様式２・３】実施希望調書!N38",null,"補助者⑦演奏時間1回目","【様式２・３】実施希望調書!N38",null,true,null,null,"【様式２・３】実施希望調書!N38"]
["補助者⑦実技時間1回目","【様式２・３】実施希望調書!S38",null,"補助者⑦実技時間1回目","【様式２・３】実施希望調書!S38",null,true,null,null,"【様式２・３】実施希望調書!S38"]
["補助者⑦単労時間1回目","【様式２・３】実施希望調書!X38",null,"補助者⑦単労時間1回目","【様式２・３】実施希望調書!X38",null,true,null,null,"【様式２・３】実施希望調書!X38"]
["補助者⑦謝金合計1回目","【様式２・３】実施希望調書!AA38",null,"補助者⑦謝金合計1回目","【様式２・３】実施希望調書!AA38",null,true,null,null,"【様式２・３】実施希望調書!AA38"]
["補助者⑧氏名1回目","【様式２・３】実施希望調書!F39",null,"補助者⑧氏名1回目","【様式２・３】実施希望調書!F39",null,true,null,null,"【様式２・３】実施希望調書!F39"]
["補助者⑧演奏時間1回目","【様式２・３】実施希望調書!N39",null,"補助者⑧演奏時間1回目","【様式２・３】実施希望調書!N39",null,true,null,null,"【様式２・３】実施希望調書!N39"]
["補助者⑧実技時間1回目","【様式２・３】実施希望調書!S39",null,"補助者⑧実技時間1回目","【様式２・３】実施希望調書!S39",null,true,null,null,"【様式２・３】実施希望調書!S39"]
["補助者⑧単労時間1回目","【様式２・３】実施希望調書!X39",null,"補助者⑧単労時間1回目","【様式２・３】実施希望調書!X39",null,true,null,null,"【様式２・３】実施希望調書!X39"]
["補助者⑧謝金合計1回目","【様式２・３】実施希望調書!AA39",null,"補助者⑧謝金合計1回目","【様式２・３】実施希望調書!AA39",null,true,null,null,"【様式２・３】実施希望調書!AA39"]
["1回目補助者人数","【様式２・３】実施希望調書!F40",null,"1回目補助者人数","【様式２・３】実施希望調書!F40",null,true,null,null,"【様式２・３】実施希望調書!F40"]
["1回目謝金合計","【様式２・３】実施希望調書!AA40",null,"1回目謝金合計","【様式２・３】実施希望調書!AA40",null,true,null,null,"【様式２・３】実施希望調書!AA40"]
["事業内容1回目","【様式２・３】実施希望調書!B42",null,"事業内容1回目","【様式２・３】実施希望調書!B42",null,true,null,null,"【様式２・３】実施希望調書!B42"]
["実施日第2回","【様式２・３】実施希望調書!E43",null,"実施日第2回","【様式２・３】実施希望調書!E43",null,true,null,null,"【様式２・３】実施希望調書!E43"]
["実施時間2回目","【様式２・３】実施希望調書!S43",null,"実施時間2回目","【様式２・３】実施希望調書!S43",null,true,null,null,"【様式２・３】実施希望調書!S43"]
["実施合計2回目","【様式２・３】実施希望調書!AA43",null,"実施合計2回目","【様式２・３】実施希望調書!AA43",null,true,null,null,"【様式２・３】実施希望調書!AA43"]
["連続する実施2回目","【様式２・３】実施希望調書!E44",null,"連続する実施2回目","【様式２・３】実施希望調書!E44",null,true,null,null,"【様式２・３】実施希望調書!E44"]
["連続都道府県2回目","【様式２・３】実施希望調書!O44",null,"連続都道府県2回目","【様式２・３】実施希望調書!O44",null,true,null,null,"【様式２・３】実施希望調書!O44"]
["連続学校名2回目","【様式２・３】実施希望調書!V44",null,"連続学校名2回目","【様式２・３】実施希望調書!V44",null,true,null,null,"【様式２・３】実施希望調書!V44"]
["教科の位置付け2回目","【様式２・３】実施希望調書!E45",null,"教科の位置付け2回目","【様式２・３】実施希望調書!E45",null,true,null,null,"【様式２・３】実施希望調書!E45"]
["教科の位置付け詳細2回目","【様式２・３】実施希望調書!S45",null,"教科の位置付け詳細2回目","【様式２・３】実施希望調書!S45",null,true,null,null,"【様式２・３】実施希望調書!S45"]
["著作権2回目","【様式２・３】実施希望調書!E46",null,"著作権2回目","【様式２・３】実施希望調書!E46",null,true,null,null,"【様式２・３】実施希望調書!E46"]
["著作権許諾取得有無2回目","【様式２・３】実施希望調書!V46",null,"著作権許諾取得有無2回目","【様式２・３】実施希望調書!V46",null,true,null,null,"【様式２・３】実施希望調書!V46"]
["参加児童生徒数2回目","【様式２・３】実施希望調書!G47",null,"参加児童生徒数2回目","【様式２・３】実施希望調書!G47",null,true,null,null,"【様式２・３】実施希望調書!G47"]
["参加児童生徒単位2回目","【様式２・３】実施希望調書!P47",null,"参加児童生徒単位2回目","【様式２・３】実施希望調書!P47",null,true,null,null,"【様式２・３】実施希望調書!P47"]
["参加児童生徒単位詳細2回目","【様式２・３】実施希望調書!S48",null,"参加児童生徒単位詳細2回目","【様式２・３】実施希望調書!S48",null,true,null,null,"【様式２・３】実施希望調書!S48"]
["補助者①氏名2回目","【様式２・３】実施希望調書!F50",null,"補助者①氏名2回目","【様式２・３】実施希望調書!F50",null,true,null,null,"【様式２・３】実施希望調書!F50"]
["補助者①演奏時間2回目","【様式２・３】実施希望調書!N50",null,"補助者①演奏時間2回目","【様式２・３】実施希望調書!N50",null,true,null,null,"【様式２・３】実施希望調書!N50"]
["補助者①実技時間2回目","【様式２・３】実施希望調書!S50",null,"補助者①実技時間2回目","【様式２・３】実施希望調書!S50",null,true,null,null,"【様式２・３】実施希望調書!S50"]
["補助者①単労時間2回目","【様式２・３】実施希望調書!X50",null,"補助者①単労時間2回目","【様式２・３】実施希望調書!X50",null,true,null,null,"【様式２・３】実施希望調書!X50"]
["補助者①謝金合計2回目","【様式２・３】実施希望調書!AA50",null,"補助者①謝金合計2回目","【様式２・３】実施希望調書!AA50",null,true,null,null,"【様式２・３】実施希望調書!AA50"]
["補助者②氏名2回目","【様式２・３】実施希望調書!F51",null,"補助者②氏名2回目","【様式２・３】実施希望調書!F51",null,true,null,null,"【様式２・３】実施希望調書!F51"]
["補助者②演奏時間2回目","【様式２・３】実施希望調書!N51",null,"補助者②演奏時間2回目","【様式２・３】実施希望調書!N51",null,true,null,null,"【様式２・３】実施希望調書!N51"]
["補助者②実技時間2回目","【様式２・３】実施希望調書!S51",null,"補助者②実技時間2回目","【様式２・３】実施希望調書!S51",null,true,null,null,"【様式２・３】実施希望調書!S51"]
["補助者②単労時間2回目","【様式２・３】実施希望調書!X51",null,"補助者②単労時間2回目","【様式２・３】実施希望調書!X51",null,true,null,null,"【様式２・３】実施希望調書!X51"]
["補助者②謝金合計2回目","【様式２・３】実施希望調書!AA51",null,"補助者②謝金合計2回目","【様式２・３】実施希望調書!AA51",null,true,null,null,"【様式２・３】実施希望調書!AA51"]
["補助者③氏名2回目","【様式２・３】実施希望調書!F52",null,"補助者③氏名2回目","【様式２・３】実施希望調書!F52",null,true,null,null,"【様式２・３】実施希望調書!F52"]
["補助者③演奏時間2回目","【様式２・３】実施希望調書!N52",null,"補助者③演奏時間2回目","【様式２・３】実施希望調書!N52",null,true,null,null,"【様式２・３】実施希望調書!N52"]
["補助者③実技時間2回目","【様式２・３】実施希望調書!S52",null,"補助者③実技時間2回目","【様式２・３】実施希望調書!S52",null,true,null,null,"【様式２・３】実施希望調書!S52"]
["補助者③単労時間2回目","【様式２・３】実施希望調書!X52",null,"補助者③単労時間2回目","【様式２・３】実施希望調書!X52",null,true,null,null,"【様式２・３】実施希望調書!X52"]
["補助者③謝金合計2回目","【様式２・３】実施希望調書!AA52",null,"補助者③謝金合計2回目","【様式２・３】実施希望調書!AA52",null,true,null,null,"【様式２・３】実施希望調書!AA52"]
["補助者④氏名2回目","【様式２・３】実施希望調書!F53",null,"補助者④氏名2回目","【様式２・３】実施希望調書!F53",null,true,null,null,"【様式２・３】実施希望調書!F53"]
["補助者④演奏時間2回目","【様式２・３】実施希望調書!N53",null,"補助者④演奏時間2回目","【様式２・３】実施希望調書!N53",null,true,null,null,"【様式２・３】実施希望調書!N53"]
["補助者④実技時間2回目","【様式２・３】実施希望調書!S53",null,"補助者④実技時間2回目","【様式２・３】実施希望調書!S53",null,true,null,null,"【様式２・３】実施希望調書!S53"]
["補助者④単労時間2回目","【様式２・３】実施希望調書!X53",null,"補助者④単労時間2回目","【様式２・３】実施希望調書!X53",null,true,null,null,"【様式２・３】実施希望調書!X53"]
["補助者④謝金合計2回目","【様式２・３】実施希望調書!AA53",null,"補助者④謝金合計2回目","【様式２・３】実施希望調書!AA53",null,true,null,null,"【様式２・３】実施希望調書!AA53"]
["補助者⑤氏名2回目","【様式２・３】実施希望調書!F54",null,"補助者⑤氏名2回目","【様式２・３】実施希望調書!F54",null,true,null,null,"【様式２・３】実施希望調書!F54"]
["補助者⑤演奏時間2回目","【様式２・３】実施希望調書!N54",null,"補助者⑤演奏時間2回目","【様式２・３】実施希望調書!N54",null,true,null,null,"【様式２・３】実施希望調書!N54"]
["補助者⑤実技時間2回目","【様式２・３】実施希望調書!S54",null,"補助者⑤実技時間2回目","【様式２・３】実施希望調書!S54",null,true,null,null,"【様式２・３】実施希望調書!S54"]
["補助者⑤単労時間2回目","【様式２・３】実施希望調書!X54",null,"補助者⑤単労時間2回目","【様式２・３】実施希望調書!X54",null,true,null,null,"【様式２・３】実施希望調書!X54"]
["補助者⑤謝金合計2回目","【様式２・３】実施希望調書!AA54",null,"補助者⑤謝金合計2回目","【様式２・３】実施希望調書!AA54",null,true,null,null,"【様式２・３】実施希望調書!AA54"]
["補助者⑥氏名2回目","【様式２・３】実施希望調書!F55",null,"補助者⑥氏名2回目","【様式２・３】実施希望調書!F55",null,true,null,null,"【様式２・３】実施希望調書!F55"]
["補助者⑥演奏時間2回目","【様式２・３】実施希望調書!N55",null,"補助者⑥演奏時間2回目","【様式２・３】実施希望調書!N55",null,true,null,null,"【様式２・３】実施希望調書!N55"]
["補助者⑥実技時間2回目","【様式２・３】実施希望調書!S55",null,"補助者⑥実技時間2回目","【様式２・３】実施希望調書!S55",null,true,null,null,"【様式２・３】実施希望調書!S55"]
["補助者⑥単労時間2回目","【様式２・３】実施希望調書!X55",null,"補助者⑥単労時間2回目","【様式２・３】実施希望調書!X55",null,true,null,null,"【様式２・３】実施希望調書!X55"]
["補助者⑥謝金合計2回目","【様式２・３】実施希望調書!AA55",null,"補助者⑥謝金合計2回目","【様式２・３】実施希望調書!AA55",null,true,null,null,"【様式２・３】実施希望調書!AA55"]
["補助者⑦氏名2回目","【様式２・３】実施希望調書!F56",null,"補助者⑦氏名2回目","【様式２・３】実施希望調書!F56",null,true,null,null,"【様式２・３】実施希望調書!F56"]
["補助者⑦演奏時間2回目","【様式２・３】実施希望調書!N56",null,"補助者⑦演奏時間2回目","【様式２・３】実施希望調書!N56",null,{"$f":"EXACT(A130,D130)","v":true},null,null,"【様式２・３】実施希望調書!N56"]
["補助者⑦実技時間2回目","【様式２・３】実施希望調書!S56",null,"補助者⑦実技時間2回目","【様式２・３】実施希望調書!S56",null,true,null,null,"【様式２・３】実施希望調書!S56"]
["補助者⑦単労時間2回目","【様式２・３】実施希望調書!X56",null,"補助者⑦単労時間2回目","【様式２・３】実施希望調書!X56",null,true,null,null,"【様式２・３】実施希望調書!X56"]
["補助者⑦謝金合計2回目","【様式２・３】実施希望調書!AA56",null,"補助者⑦謝金合計2回目","【様式２・３】実施希望調書!AA56",null,true,null,null,"【様式２・３】実施希望調書!AA56"]
["補助者⑧氏名2回目","【様式２・３】実施希望調書!F57",null,"補助者⑧氏名2回目","【様式２・３】実施希望調書!F57",null,true,null,null,"【様式２・３】実施希望調書!F57"]
["補助者⑧演奏時間2回目","【様式２・３】実施希望調書!N57",null,"補助者⑧演奏時間2回目","【様式２・３】実施希望調書!N57",null,true,null,null,"【様式２・３】実施希望調書!N57"]
["補助者⑧実技時間2回目","【様式２・３】実施希望調書!S57",null,"補助者⑧実技時間2回目","【様式２・３】実施希望調書!S57",null,true,null,null,"【様式２・３】実施希望調書!S57"]
["補助者⑧単労時間2回目","【様式２・３】実施希望調書!X57",null,"補助者⑧単労時間2回目","【様式２・３】実施希望調書!X57",null,true,null,null,"【様式２・３】実施希望調書!X57"]
["補助者⑧謝金合計2回目","【様式２・３】実施希望調書!AA57",null,"補助者⑧謝金合計2回目","【様式２・３】実施希望調書!AA57",null,true,null,null,"【様式２・３】実施希望調書!AA57"]
["2回目補助者人数","【様式２・３】実施希望調書!F58",null,"2回目補助者人数","【様式２・３】実施希望調書!F58",null,true,null,null,"【様式２・３】実施希望調書!F58"]
["2回目謝金合計","【様式２・３】実施希望調書!AA58",null,"2回目謝金合計","【様式２・３】実施希望調書!AA58",null,true,null,null,"【様式２・３】実施希望調書!AA58"]
["事業内容2回目","【様式２・３】実施希望調書!B60",null,"事業内容2回目","【様式２・３】実施希望調書!B60",null,true,null,null,"【様式２・３】実施希望調書!B60"]
["実施日第3回","【様式２・３】実施希望調書!E61",null,"実施日第3回","【様式２・３】実施希望調書!E61",null,true,null,null,"【様式２・３】実施希望調書!E61"]
["実施時間3回目","【様式２・３】実施希望調書!S61",null,"実施時間3回目","【様式２・３】実施希望調書!S61",null,true,null,null,"【様式２・３】実施希望調書!S61"]
["実施合計3回目","【様式２・３】実施希望調書!AA61",null,"実施合計3回目","【様式２・３】実施希望調書!AA61",null,true,null,null,"【様式２・３】実施希望調書!AA61"]
["連続する実施3回目","【様式２・３】実施希望調書!E62",null,"連続する実施3回目","【様式２・３】実施希望調書!E62",null,true,null,null,"【様式２・３】実施希望調書!E62"]
["連続都道府県3回目","【様式２・３】実施希望調書!O62",null,"連続都道府県3回目","【様式２・３】実施希望調書!O62",null,true,null,null,"【様式２・３】実施希望調書!O62"]
["連続学校名3回目","【様式２・３】実施希望調書!V62",null,"連続学校名3回目","【様式２・３】実施希望調書!V62",null,true,null,null,"【様式２・３】実施希望調書!V62"]
["教科の位置付け3回目","【様式２・３】実施希望調書!E63",null,"教科の位置付け3回目","【様式２・３】実施希望調書!E63",null,true,null,null,"【様式２・３】実施希望調書!E63"]
["教科の位置付け詳細3回目","【様式２・３】実施希望調書!S63",null,"教科の位置付け詳細3回目","【様式２・３】実施希望調書!S63",null,true,null,null,"【様式２・３】実施希望調書!S63"]
["著作権3回目","【様式２・３】実施希望調書!E64",null,"著作権3回目","【様式２・３】実施希望調書!E64",null,true,null,null,"【様式２・３】実施希望調書!E64"]
["著作権許諾取得有無3回目","【様式２・３】実施希望調書!V64",null,"著作権許諾取得有無3回目","【様式２・３】実施希望調書!V64",null,true,null,null,"【様式２・３】実施希望調書!V64"]
["参加児童生徒数3回目","【様式２・３】実施希望調書!G65",null,"参加児童生徒数3回目","【様式２・３】実施希望調書!G65",null,true,null,null,"【様式２・３】実施希望調書!G65"]
["参加児童生徒単位3回目","【様式２・３】実施希望調書!P65",null,"参加児童生徒単位3回目","【様式２・３】実施希望調書!P65",null,true,null,null,"【様式２・３】実施希望調書!P65"]
["参加児童生徒単位詳細3回目","【様式２・３】実施希望調書!S66",null,"参加児童生徒単位詳細3回目","【様式２・３】実施希望調書!S66",null,true,null,null,"【様式２・３】実施希望調書!S66"]
["補助者①氏名3回目","【様式２・３】実施希望調書!F68",null,"補助者①氏名3回目","【様式２・３】実施希望調書!F68",null,true,null,null,"【様式２・３】実施希望調書!F68"]
["補助者①演奏時間3回目","【様式２・３】実施希望調書!N68",null,"補助者①演奏時間3回目","【様式２・３】実施希望調書!N68",null,true,null,null,"【様式２・３】実施希望調書!N68"]
["補助者①実技時間3回目","【様式２・３】実施希望調書!S68",null,"補助者①実技時間3回目","【様式２・３】実施希望調書!S68",null,true,null,null,"【様式２・３】実施希望調書!S68"]
["補助者①単労時間3回目","【様式２・３】実施希望調書!X68",null,"補助者①単労時間3回目","【様式２・３】実施希望調書!X68",null,true,null,null,"【様式２・３】実施希望調書!X68"]
["補助者①謝金合計3回目","【様式２・３】実施希望調書!AA68",null,"補助者①謝金合計3回目","【様式２・３】実施希望調書!AA68",null,true,null,null,"【様式２・３】実施希望調書!AA68"]
["補助者②氏名3回目","【様式２・３】実施希望調書!F69",null,"補助者②氏名3回目","【様式２・３】実施希望調書!F69",null,true,null,null,"【様式２・３】実施希望調書!F69"]
["補助者②演奏時間3回目","【様式２・３】実施希望調書!N69",null,"補助者②演奏時間3回目","【様式２・３】実施希望調書!N69",null,true,null,null,"【様式２・３】実施希望調書!N69"]
["補助者②実技時間3回目","【様式２・３】実施希望調書!S69",null,"補助者②実技時間3回目","【様式２・３】実施希望調書!S69",null,true,null,null,"【様式２・３】実施希望調書!S69"]
["補助者②単労時間3回目","【様式２・３】実施希望調書!X69",null,"補助者②単労時間3回目","【様式２・３】実施希望調書!X69",null,true,null,null,"【様式２・３】実施希望調書!X69"]
["補助者②謝金合計3回目","【様式２・３】実施希望調書!AA69",null,"補助者②謝金合計3回目","【様式２・３】実施希望調書!AA69",null,true,null,null,"【様式２・３】実施希望調書!AA69"]
["補助者③氏名3回目","【様式２・３】実施希望調書!F70",null,"補助者③氏名3回目","【様式２・３】実施希望調書!F70",null,true,null,null,"【様式２・３】実施希望調書!F70"]
["補助者③演奏時間3回目","【様式２・３】実施希望調書!N70",null,"補助者③演奏時間3回目","【様式２・３】実施希望調書!N70",null,true,null,null,"【様式２・３】実施希望調書!N70"]
["補助者③実技時間3回目","【様式２・３】実施希望調書!S70",null,"補助者③実技時間3回目","【様式２・３】実施希望調書!S70",null,true,null,null,"【様式２・３】実施希望調書!S70"]
["補助者③単労時間3回目","【様式２・３】実施希望調書!X70",null,"補助者③単労時間3回目","【様式２・３】実施希望調書!X70",null,true,null,null,"【様式２・３】実施希望調書!X70"]
["補助者③謝金合計3回目","【様式２・３】実施希望調書!AA70",null,"補助者③謝金合計3回目","【様式２・３】実施希望調書!AA70",null,true,null,null,"【様式２・３】実施希望調書!AA70"]
["補助者④氏名3回目","【様式２・３】実施希望調書!F71",null,"補助者④氏名3回目","【様式２・３】実施希望調書!F71",null,true,null,null,"【様式２・３】実施希望調書!F71"]
["補助者④演奏時間3回目","【様式２・３】実施希望調書!N71",null,"補助者④演奏時間3回目","【様式２・３】実施希望調書!N71",null,true,null,null,"【様式２・３】実施希望調書!N71"]
["補助者④実技時間3回目","【様式２・３】実施希望調書!S71",null,"補助者④実技時間3回目","【様式２・３】実施希望調書!S71",null,true,null,null,"【様式２・３】実施希望調書!S71"]
["補助者④単労時間3回目","【様式２・３】実施希望調書!X71",null,"補助者④単労時間3回目","【様式２・３】実施希望調書!X71",null,true,null,null,"【様式２・３】実施希望調書!X71"]
["補助者④謝金合計3回目","【様式２・３】実施希望調書!AA71",null,"補助者④謝金合計3回目","【様式２・３】実施希望調書!AA71",null,true,null,null,"【様式２・３】実施希望調書!AA71"]
["補助者⑤氏名3回目","【様式２・３】実施希望調書!F72",null,"補助者⑤氏名3回目","【様式２・３】実施希望調書!F72",null,true,null,null,"【様式２・３】実施希望調書!F72"]
["補助者⑤演奏時間3回目","【様式２・３】実施希望調書!N72",null,"補助者⑤演奏時間3回目","【様式２・３】実施希望調書!N72",null,true,null,null,"【様式２・３】実施希望調書!N72"]
["補助者⑤実技時間3回目","【様式２・３】実施希望調書!S72",null,"補助者⑤実技時間3回目","【様式２・３】実施希望調書!S72",null,true,null,null,"【様式２・３】実施希望調書!S72"]
["補助者⑤単労時間3回目","【様式２・３】実施希望調書!X72",null,"補助者⑤単労時間3回目","【様式２・３】実施希望調書!X72",null,true,null,null,"【様式２・３】実施希望調書!X72"]
["補助者⑤謝金合計3回目","【様式２・３】実施希望調書!AA72",null,"補助者⑤謝金合計3回目","【様式２・３】実施希望調書!AA72",null,true,null,null,"【様式２・３】実施希望調書!AA72"]
["補助者⑥氏名3回目","【様式２・３】実施希望調書!F73",null,"補助者⑥氏名3回目","【様式２・３】実施希望調書!F73",null,true,null,null,"【様式２・３】実施希望調書!F73"]
["補助者⑥演奏時間3回目","【様式２・３】実施希望調書!N73",null,"補助者⑥演奏時間3回目","【様式２・３】実施希望調書!N73",null,true,null,null,"【様式２・３】実施希望調書!N73"]
["補助者⑥実技時間3回目","【様式２・３】実施希望調書!S73",null,"補助者⑥実技時間3回目","【様式２・３】実施希望調書!S73",null,true,null,null,"【様式２・３】実施希望調書!S73"]
["補助者⑥単労時間3回目","【様式２・３】実施希望調書!X73",null,"補助者⑥単労時間3回目","【様式２・３】実施希望調書!X73",null,true,null,null,"【様式２・３】実施希望調書!X73"]
["補助者⑥謝金合計3回目","【様式２・３】実施希望調書!AA73",null,"補助者⑥謝金合計3回目","【様式２・３】実施希望調書!AA73",null,true,null,null,"【様式２・３】実施希望調書!AA73"]
["補助者⑦氏名3回目","【様式２・３】実施希望調書!F74",null,"補助者⑦氏名3回目","【様式２・３】実施希望調書!F74",null,true,null,null,"【様式２・３】実施希望調書!F74"]
["補助者⑦演奏時間3回目","【様式２・３】実施希望調書!N74",null,"補助者⑦演奏時間3回目","【様式２・３】実施希望調書!N74",null,true,null,null,"【様式２・３】実施希望調書!N74"]
["補助者⑦実技時間3回目","【様式２・３】実施希望調書!S74",null,"補助者⑦実技時間3回目","【様式２・３】実施希望調書!S74",null,true,null,null,"【様式２・３】実施希望調書!S74"]
["補助者⑦単労時間3回目","【様式２・３】実施希望調書!X74",null,"補助者⑦単労時間3回目","【様式２・３】実施希望調書!X74",null,true,null,null,"【様式２・３】実施希望調書!X74"]
["補助者⑦謝金合計3回目","【様式２・３】実施希望調書!AA74",null,"補助者⑦謝金合計3回目","【様式２・３】実施希望調書!AA74",null,true,null,null,"【様式２・３】実施希望調書!AA74"]
["補助者⑧氏名3回目","【様式２・３】実施希望調書!F75",null,"補助者⑧氏名3回目","【様式２・３】実施希望調書!F75",null,true,null,null,"【様式２・３】実施希望調書!F75"]
["補助者⑧演奏時間3回目","【様式２・３】実施希望調書!N75",null,"補助者⑧演奏時間3回目","【様式２・３】実施希望調書!N75",null,true,null,null,"【様式２・３】実施希望調書!N75"]
["補助者⑧実技時間3回目","【様式２・３】実施希望調書!S75",null,"補助者⑧実技時間3回目","【様式２・３】実施希望調書!S75",null,true,null,null,"【様式２・３】実施希望調書!S75"]
["補助者⑧単労時間3回目","【様式２・３】実施希望調書!X75",null,"補助者⑧単労時間3回目","【様式２・３】実施希望調書!X75",null,true,null,null,"【様式２・３】実施希望調書!X75"]
["補助者⑧謝金合計3回目","【様式２・３】実施希望調書!AA75",null,"補助者⑧謝金合計3回目","【様式２・３】実施希望調書!AA75",null,{"$f":"EXACT(A194,D194)","v":true},null,null,"【様式２・３】実施希望調書!AA75"]
["3回目補助者人数","【様式２・３】実施希望調書!F76",null,"3回目補助者人数","【様式２・３】実施希望調書!F76",null,true,null,null,"【様式２・３】実施希望調書!F76"]
["3回目謝金合計","【様式２・３】実施希望調書!AA76",null,"3回目謝金合計","【様式２・３】実施希望調書!AA76",null,true,null,null,"【様式２・３】実施希望調書!AA76"]
["事業内容3回目","【様式２・３】実施希望調書!B78",null,"事業内容3回目","【様式２・３】実施希望調書!B78",null,true,null,null,"【様式２・３】実施希望調書!B78"]
["謝金","【様式２・３】実施希望調書!M102",null,"謝金","【様式２・３】実施希望調書!M102",null,true,null,null,"【様式２・３】実施希望調書!M102"]
["旅費","【様式２・３】実施希望調書!S102",null,"旅費","【様式２・３】実施希望調書!S102",null,true,null,null,"【様式２・３】実施希望調書!S102"]
["講演等\n諸雑費","【様式２・３】実施希望調書!Y115",null,"講演等\n諸雑費","【様式２・３】実施希望調書!Y115",null,true,null,null,"【様式２・３】実施希望調書!Y115"]
["合計","【様式２・３】実施希望調書!S120",null,"合計","【様式２・３】実施希望調書!S120",null,true,null,null,"【様式２・３】実施希望調書!S120"]

{"sheet":"【分野】","index":5,"n_rows":12,"n_cols":34,"rows_kept":12,"cut":false,"hidden":false,"merged":[[10,28,10,31],[10,32,10,35],[11,0,11,35],[9,25,9,27],[9,29,9,31],[9,32,9,35],[10,1,10,3],[10,5,10,7],[10,9,10,11],[10,13,10,15],[10,17,10,19],[10,21,10,23],[10,24,10,27],[9,1,9,3],[9,5,9,7],[9,9,9,11],[9,13,9,15],[9,17,9,19],[9,21,9,23],[7,33,7,35],[8,1,8,3],[8,5,8,7],[8,9,8,11],[8,13,8,15],[8,16,8,19],[8,20,8,23],[8,24,8,27],[8,28,8,31],[8,32,8,35],[6,29,6,31],[6,32,6,35],[7,1,7,3],[7,5,7,7],[7,9,7,11],[7,13,7,15],[7,17,7,19],[7,21,7,23],[7,25,7,27],[7,29,7,31],[5,24,5,27],[5,28,5,31],[5,32,5,35],[6,1,6,3],[6,5,6,7],[6,9,6,11],[6,13,6,15],[6,17,6,19],[6,21,6,23],[6,25,6,27],[5,1,5,3],[5,5,5,7],[5,9,5,11],[5,13,5,15],[5,17,5,19],[5,21,5,23],[4,20,4,23],[4,24,4,27],[4,28,4,31],[4,32,4,35],[3,1,3,3],[3,5,3,7],[3,9,3,11],[3,13,3,15],[3,17,3,19],[4,1,4,3],[4,5,4,7],[4,9,4,11],[4,13,4,15],[4,17,4,19],[3,20,3,23],[3,24,3,27],[3,28,3,31],[3,32,3,35],[0,0,0,35],[1,0,1,3],[1,4,1,35],[2,1,2,3],[2,5,2,7],[2,9,2,11],[2,13,2,15],[2,17,2,19],[2,21,2,23],[2,25,2,27],[2,28,2,31],[2,32,2,35]]}
["【分野】"]
["大項目",null,null,null,"中項目"]
[1,"音楽",null,null,"A","ピアノ",null,null,"B","声楽",null,null,"C","弦楽器",null,null,"D","パーカッション",null,null,"E","管楽器",null,null,"F","その他"]
[2,"演劇",null,null,"A","現代劇",null,null,"B","ミュージカル",null,null,"C","人形劇",null,null,"D","その他"]
[3,"舞踊",null,null,"A","バレエ",null,null,"B","現代舞踊",null,null,"C","身体表現",null,null,"D","その他"]
[4,"大衆芸能",null,null,"A","落語",null,null,"B","講談",null,null,"C","漫才",null,null,"D","浪曲",null,null,"E","その他"]
[5,"美術",null,null,"A","洋画",null,null,"B","日本画",null,null,"C","版画",null,null,"D","彫刻",null,null,"E","書",null,null,"F","写真",null,null,"G","その他"]
[6,"伝統芸能",null,null,"A","歌舞伎",null,null,"B","　能楽",null,null,"C","人形浄瑠璃",null,null,"D","日本舞踊",null,null,"E","和太鼓",null,null,"F","箏",null,null,"G","三味線",null,null,"H","その他"]
[7,"文学",null,null,"A","俳句",null,null,"B","朗読",null,null,"C","その他"]
[8,"生活文化",null,null,"A","囲碁",null,null,"B","将棋",null,null,"C","華道",null,null,"D","茶道",null,null,"E","和装",null,null,"F","食文化",null,null,"G","その他"]
[9,"メディア\n芸術",null,null,"A","メディアアート",null,null,"B","映画",null,null,"C","アニメーション",null,null,"D","マンガ",null,null,"E","その他"]
["※様式１，様式２及び様式６の実施分野欄に，大項目の数字・中項目の英字を記入してください"]

{"sheet":"選択肢","index":6,"n_rows":68,"n_cols":2,"rows_kept":68,"cut":false,"hidden":true,"merged":[]}
["NO","都道府県"]
[1,"北海道"]
[2,"青森県"]
[3,"岩手県"]
[4,"宮城県"]
[5,"秋田県"]
[6,"山形県"]
[7,"福島県"]
[8,"茨城県"]
[9,"栃木県"]
[10,"群馬県"]
[11,"埼玉県"]
[12,"千葉県"]
[13,"東京都"]
[14,"神奈川県"]
[15,"新潟県"]
[16,"富山県"]
[17,"石川県"]
[18,"福井県"]
[19,"山梨県"]
[20,"長野県"]
[21,"岐阜県"]
[22,"静岡県"]
[23,"愛知県"]
[24,"三重県"]
[25,"滋賀県"]
[26,"京都府"]
[27,"大阪府"]
[28,"兵庫県"]
[29,"奈良県"]
[30,"和歌山県"]
[31,"鳥取県"]
[32,"島根県"]
[33,"岡山県"]
[34,"広島県"]
[35,"山口県"]
[36,"徳島県"]
[37,"香川県"]
[38,"愛媛県"]
[39,"高知県"]
[40,"福岡県"]
[41,"佐賀県"]
[42,"長崎県"]
[43,"熊本県"]
[44,"大分県"]
[45,"宮崎県"]
[46,"鹿児島県"]
[47,"沖縄県"]
[48,"札幌市"]
[49,"仙台市"]
[50,"さいたま市"]
[51,"千葉市"]
[52,"横浜市"]
[53,"川崎市"]
[54,"相模原市"]
[55,"新潟市"]
[56,"静岡市"]
[57,"浜松市"]
[58,"名古屋市"]
[59,"京都市"]
[60,"大阪市"]
[61,"堺市"]
[62,"神戸市"]
[63,"岡山市"]
[64,"広島市"]
[65,"北九州市"]
[66,"福岡市"]
[67,"熊本市"]

{"sheet":"マスター_都道府県CD","index":7,"n_rows":1212,"n_cols":25,"rows_kept":1212,"cut":false,"hidden":true,"merged":[]}
["教受付NO","都道府県","教受付NO"]
[1,"北海道",1]
[2,"青森県",2]
[3,"岩手県",3]
[4,"宮城県",4]
[5,"秋田県",5]
[6,"山形県",6]
[7,"福島県",7]
[8,"茨城県",8]
[9,"栃木県",9]
[10,"群馬県",10]
[11,"埼玉県",11]
[12,"千葉県",12]
[13,"東京都",13]
[14,"神奈川県",14]
[15,"新潟県",15]
[16,"富山県",16]
[17,"石川県",17]
[18,"福井県",18]
[19,"山梨県",19]
[20,"長野県",20]
[21,"岐阜県",21]
[22,"静岡県",22]
[23,"愛知県",23]
[24,"三重県",24]
[25,"滋賀県",25]
[26,"京都府",26]
[27,"大阪府",27]
[28,"兵庫県",28]
[29,"奈良県",29]
[30,"和歌山県",30]
[31,"鳥取県",31]
[32,"島根県",32]
[33,"岡山県",33]
[34,"広島県",34]
[35,"山口県",35]
[36,"徳島県",36]
[37,"香川県",37]
[38,"愛媛県",38]
[39,"高知県",39]
[40,"福岡県",40]
[41,"佐賀県",41]
[42,"長崎県",42]
[43,"熊本県",43]
[44,"大分県",44]
[45,"宮崎県",45]
[46,"鹿児島県",46]
[47,"沖縄県",47]
[48,"札幌市",48]
[49,"仙台市",49]
[50,"さいたま市",50]
[51,"千葉市",51]
[52,"横浜市",52]
[53,"川崎市",53]
[54,"相模原市",54]
[55,"新潟市",55]
[56,"静岡市",56]
[57,"浜松市",57]
[58,"名古屋市",58]
[59,"京都市",59]
[60,"大阪市",60]
[61,"堺市",61]
[62,"神戸市",62]
[63,"岡山市",63]
[64,"広島市",64]
[65,"北九州市",65]
[66,"福岡市",66]
[67,"熊本市",67]
[]
[]
[]
[]
[]
[]
[]
[]
[]
[]
[]
[]
[]
[]
[]
[]
[]
[]
[]
[]
[]
[]
[]
[]
[]
[]
[]
[]
[]
[]
[]
[]
[]
[]
[]
[]
[]
[]
[]
[]
[]
[]
[]
[]
[]
[]
[]
[]
[]
[]
[]
[]
[]
[]
[]
[]
[]
[]
[]
[]
[]
[]
[]
[]
[]
[]
[]
[]
[]
[]
[]
[]
[]
[]
[]
[]
[]
[]
[]
[]
[]
[]
[]
[]
[]
[]
[]
[]
[]
[]
[]
[]
[]
[]
[]
[]
[]
[]
[]
[]
[]
[]
[]
[]
[]
[]
[]
[]
[]
[]
[]
[]
[]
[]
[]
[]
[]
[]
[]
[]
[]
[]
[]
[]
[]
[]
[]
[]
[]
[]
[]
[]
[]
[]
[]
[]
[]
[]
[]
[]
[]
[]
[]
[]
[]
[]
[]
[]
[]
[]
[]
[]
[]
[]
[]
[]
[]
[]
[]
[]
[]
[]
[]
[]
[]
[]
[]
[]
[]
[]
[]
[]
[]
[]
[]
[]
[]
[]
[]
[]
[]
[]
[]
[]
[]
[]
[]
[]
[]
[]
[]
[]
[]
[]
[]
[]
[]
[]
[]
[]
[]
[]
[]
[]
[]
[]
[]
[]
[]
[]
[]
[]
[]
[]
[]
[]
[]
[]
[]
[]
[]
[]
[]
[]
[]
[]
[]
[]
[]
[]
[]
[]
[]
[]
[]
[]
[]
[]
[]
[]
[]
[]
[]
[]
[]
[]
[]
[]
[]
[]
[]
[]
[]
[]
[]
[]
[]
[]
[]
[]
[]
[]
[]
[]
[]
[]
[]
[]
[]
[]
[]
[]
[]
[]
[]
[]
[]
[]
[]
[]
[]
[]
[]
[]
[]
[]
[]
[]
[]
[]
[]
[]
[]
[]
[]
[]
[]
[]
[]
[]
[]
[]
[]
[]
[]
[]
[]
[]
[]
[]
[]
[]
[]
[]
[]
[]
[]
[]
[]
[]
[]
[]
[]
[]
[]
[]
[]
[]
[]
[]
[]
[]
[]
[]
[]
[]
[]
[]
[]
[]
[]
[]
[]
[]
[]
[]
[]
[]
[]
[]
[]
[]
[]
[]
[]
[]
[]
[]
[]
[]
[]
[]
[]
[]
[]
[]
[]
[]
[]
[]
[]
[]
[]
[]
[]
[]
[]
[]
[]
[]
[]
[]
[]
[]
[]
[]
[]
[]
[]
[]
[]
[]
[]
[]
[]
[]
[]
[]
[]
[]
[]
[]
[]
[]
[]
[]
[]
[]
[]
[]
[]
[]
[]
[]
[]
[]
[]
[]
[]
[]
[]
[]
[]
[]
[]
[]
[]
[]
[]
[]
[]
[]
[]
[]
[]
[]
[]
[]
[]
[]
[]
[]
[]
[]
[]
[]
[]
[]
[]
[]
[]
[]
[]
[]
[]
[]
[]
[]
[]
[]
[]
[]
[]
[]
[]
[]
[]
[]
[]
[]
[]
[]
[]
[]
[]
[]
[]
[]
[]
[]
[]
[]
[]
[]
[]
[]
[]
[]
[]
[]
[]
[]
[]
[]
[]
[]
[]
[]
[]
[]
[]
[]
[]
[]
[]
[]
[]
[]
[]
[]
[]
[]
[]
[]
[]
[]
[]
[]
[]
[]
[]
[]
[]
[]
[]
[]
[]
[]
[]
[]
[]
[]
[]
[]
[]
[]
[]
[]
[]
[]
[]
[]
[]
[]
[]
[]
[]
[]
[]
[]
[]
[]
[]
[]
[]
[]
[]
[]
[]
[]
[]
[]
[]
[]
[]
[]
[]
[]
[]
[]
[]
[]
[]
[]
[]
[]
[]
[]
[]
[]
[]
[]
[]
[]
[]
[]
[]
[]
[]
[]
[]
[]
[]
[]
[]
[]
[]
[]
[]
[]
[]
[]
[]
[]
[]
[]
[]
[]
[]
[]
[]
[]
[]
[]
[]
[]
[]
[]
[]
[]
[]
[]
[]
[]
[]
[]
[]
[]
[]
[]
[]
[]
[]
[]
[]
[]
[]
[]
[]
[]
[]
[]
[]
[]
[]
[]
[]
[]
[]
[]
[]
[]
[]
[]
[]
[]
[]
[]
[]
[]
[]
[]
[]
[]
[]
[]
[]
[]
[]
[]
[]
[]
[]
[]
[]
[]
[]
[]
[]
[]
[]
[]
[]
[]
[]
[]
[]
[]
[]
[]
[]
[]
[]
[]
[]
[]
[]
[]
[]
[]
[]
[]
[]
[]
[]
[]
[]
[]
[]
[]
[]
[]
[]
[]
[]
[]
[]
[]
[]
[]
[]
[]
[]
[]
[]
[]
[]
[]
[]
[]
[]
[]
[]
[]
[]
[]
[]
[]
[]
[]
[]
[]
[]
[]
[]
[]
[]
[]
[]
[]
[]
[]
[]
[]
[]
[]
[]
[]
[]
[]
[]
[]
[]
[]
[]
[]
[]
[]
[]
[]
[]
[]
[]
[]
[]
[]
[]
[]
[]
[]
[]
[]
[]
[]
[]
[]
[]
[]
[]
[]
[]
[]
[]
[]
[]
[]
[]
[]
[]
[]
[]
[]
[]
[]
[]
[]
[]
[]
[]
[]
[]
[]
[]
[]
[]
[]
[]
[]
[]
[]
[]
[]
[]
[]
[]
[]
[]
[]
[]
[]
[]
[]
[]
[]
[]
[]
[]
[]
[]
[]
[]
[]
[]
[]
[]
[]
[]
[]
[]
[]
[]
[]
[]
[]
[]
[]
[]
[]
[]
[]
[]
[]
[]
[]
[]
[]
[]
[]
[]
[]
[]
[]
[]
[]
[]
[]
[]
[]
[]
[]
[]
[]
[]
[]
[]
[]
[]
[]
[]
[]
[]
[]
[]
[]
[]
[]
[]
[]
[]
[]
[]
[]
[]
[]
[]
[]
[]
[]
[]
[]
[]
[]
[]
[]
[]
[]
[]
[]
[]
[]
[]
[]
[]
[]
[]
[]
[]
[]
[]
[]
[]
[]
[]
[]
[]
[]
[]
[]
[]
[]
[]
[]
[]
[]
[]
[]
[]
[]
[]
[]
[]
[]
[]
[]
[]
[]
[]
[]
[]
[]
[]
[]
[]
[]
[]
[]
[]
[]
[]
[]
[]
[]
[]
[]
[]
[]
[]
[]
[]
[]
[]
[]
[]
[]
[]
[]
[]
[]
[]
[]
[]
[]
[]
[]
[]
[]
[]
[]
[]
[]
[]
[]
[]
[]
[]
[]
[]
[]
[]
[]
[]
[]
[]
[]
[]
[]
[]
[]
[]
[]
[]
[]
[]
[]
[]
[]
[]
[]
[]
[]
[]
[]
[]
[]
[]
[]
[]
[]
[]
[]
[]
[]
[]
[]
[]
[]
[]
[]
[]
[]
[]
[]
[]
[]
[]
[]
[]
[]
[]
[]
[]
[]
[]
[]
[]
[]
[]
[]
[]
[]
[]
[]
[]
[]
[]
[]
[]
[]
[]
[]
[]
[]
[]
[]
[]
[]
[]
[]
[]
[]
[]
[]
[]
[]
[]
[]
[]
[]
[]
[null,null,"埼玉県",1,"熊谷市立桜木小学校",1,"回","2018-12-19",null,null,"齊藤　才子",3,"舞踊","C","　身体表現",15,"人",181500,"円",8820,"円",0,"円",{"$f":"SUM(R1168:V1168)","v":190320},"円"]
[null,null,"埼玉県",2,"熊谷市立星宮小学校",1,"回","2018-10-31",null,null,"齊藤　才子",1,"音楽","E","　管楽器",15,"人",354000,"円",500000,"円",0,"円",{"$f":"SUM(R1169:V1169)","v":854000},"円"]
[null,null,"埼玉県",3,"朝霞市立第九小学校",2,"回","2018-10-17","2018-10-18",null,"小川　正毅",1,"音楽","E","　管楽器",15,"人",393000,"円",92155,"円",50000,"円",535155,"円"]
[null,null,"埼玉県",4,"鶴ヶ島市立西中学校",3,"回","2018-05-12","2018-06-02","2018-06-09","野上　博幸",1,"音楽","E","　管楽器",15,"人",393000,"円",92285,"円",50000,"円",535285,"円"]
[null,null,"埼玉県",5,"狭山市立狭山台中学校",3,"回","2018-06-07","2018-07-10","2018-10-22","濱口　裕輔",1,"音楽","F","　その他",10,"人",198000,"円",31120,"円",50000,"円",279120,"円"]
[null,null,"埼玉県",6,null,null,"回",null,null,null,null,1,"音楽","F","　その他",10,"人",262000,"円",47960,"円",50000,"円",359960,"円"]
[null,null,"埼玉県",7,null,null,"回",null,null,null,null,3,"舞踊","B","　現代舞踊",15,"人",393000,"円",45600,"円",0,"円",438600,"円"]
[null,null,"埼玉県",8,null,null,"回",null,null,null,null,6,"伝統芸能","F","　箏",6,"人",185200,"円",57236,"円",50000,"円",292436,"円"]
[null,null,"埼玉県",9,null,null,"回",null,null,null,null,6,"伝統芸能","F","　箏",6,"人",185200,"円",51740,"円",50000,"円",286940,"円"]
[null,null,"埼玉県",10,null,null,"回",null,null,null,null,1,"音楽","E","　管楽器",12,"人",335400,"円",22902,"円",50000,"円",408302,"円"]
[null,null,"埼玉県",11,null,null,"回",null,null,null,null,6,"伝統芸能","F","　箏",0,"人",35000,"円",0,"円",0,"円",35000,"円"]
[null,null,"埼玉県",12,null,null,"回",null,null,null,null,1,"音楽","E","　管楽器",5,"人",131000,"円",30706,"円",50000,"円",211706,"円"]
[null,null,"埼玉県",13,null,null,"回",null,null,null,null,2,"演劇","A","　現代劇",3,"人",135600,"円",5934,"円",0,"円",141534,"円"]
[null,null,"埼玉県",14,null,null,"回",null,null,null,null,1,"音楽","D","　パーカッション",4,"人",111800,"円",31199,"円",32680,"円",175679,"円"]
[null,null,"埼玉県",15,null,null,"回",null,null,null,null,1,"音楽","E","　管楽器",12,"人",335400,"円",62168,"円",50000,"円",447568,"円"]
[null,null,"埼玉県",16,null,null,"回",null,null,null,null,1,"音楽","E","　管楽器",12,"人",335400,"円",60113,"円",50000,"円",445513,"円"]
[null,null,"埼玉県",17,null,null,"回",null,null,null,null,1,"音楽","D","　パーカッション",4,"人",111800,"円",23432,"円",32680,"円",167912,"円"]
[null,null,"埼玉県",18,null,null,"回",null,null,null,null,1,"音楽","D","　パーカッション",2,"人",73400,"円",12878,"円",32680,"円",118958,"円"]
[null,null,"埼玉県",19,null,null,"回",null,null,null,null,1,"音楽","D","　パーカッション",3,"人",92600,"円",10332,"円",16480,"円",119412,"円"]
[null,null,"埼玉県",20,null,null,"回",null,null,null,null,7,"文学","B","　朗読",2,"人",73400,"円",4860,"円",50000,"円",128260,"円"]
[null,null,"埼玉県",21,"川口市立十二月田小学校",1,"回","2018-07-04",null,null,"三田　浩則",1,"音楽","D","　パーカッション",2,"人",73400,"円",11108,"円",32680,"円",{"$f":"SUM(R1188:V1188)","v":117188},"円"]
[null,null,"埼玉県",22,"和光市立広沢小学校",1,"回","2018-10-10",null,null,"三田　浩則",1,"音楽","D","　パーカッション",2,"人",73400,"円",12111,"円",32680,"円",{"$f":"SUM(R1189:V1189)","v":118191},"円"]
[null,null,"埼玉県",23,"戸田市立戸田南小学校",3,"回","2018-07-16","2018-07-17","2018-07-18","小川　正毅",1,"音楽","E","　管楽器",12,"人",335400,"円",24144,"円",50000,"円",409544,"円"]
[null,null,"埼玉県",24,"加須市立田ケ谷小学校",2,"回","2018-11-07","2018-11-08",null,"小川　正毅",1,"音楽","E","　管楽器",8,"人",223600,"円",43206,"円",50000,"円",316806,"円"]
[null,null,"埼玉県",25,"久喜市立鷲宮小学校",1,"回","2018-11-12",null,null,"安村　今日子",1,"音楽","F","　その他",1,"人",47800,"円",5260,"円",0,"円",53060,"円"]
[null,null,"埼玉県",26,"久喜市立栗橋西小学校",3,"回","2018-11-07","2018-11-21","2018-11-28","大谷　宥仁",5,"美術","C","　版画",0,"人",105000,"円",3300,"円",0,"円",108300,"円"]
[null,null,"埼玉県",27,"伊奈町立小針北小学校",3,"回","2018-11-01","2018-11-18","2018-11-19","小川　正毅",1,"音楽","E","　管楽器",12,"人",335400,"円",75905,"円",50000,"円",461305,"円"]
[null,null,"埼玉県",28,"熊谷市立久下小学校",1,"回","2018-12-11",null,null,"齊藤　才子",6,"伝統芸能","F","　箏",3,"人",92600,"円",28248,"円",50000,"円",170848,"円"]
[null,null,"埼玉県",29,"上尾市立大谷小学校",3,"回","2018-06-04","2018-06-05","2018-06-06","小川　正毅",1,"音楽","E","　管楽器",12,"人",335400,"円",29335,"円",50000,"円",414735,"円"]
[null,null,"埼玉県",30,"上尾市立芝川小学校",1,"回","2018-06-03",null,null,"小川　正毅",1,"音楽","E","　管楽器",4,"人",111800,"円",19871,"円",50000,"円",181671,"円"]
[null,null,"埼玉県",31,"三郷市立桜小学校",1,"回","2018-10-31",null,null,"三田　浩則",1,"音楽","D","　パーカッション",2,"人",73400,"円",12944,"円",32680,"円",119024,"円"]
[null,null,"埼玉県",32,"行田市立太田西小学校",3,"回","2018-09-09","2018-10-21","2018-11-25","岡島　敦子",1,"音楽","B","　声楽",7,"人",212100,"円",31566,"円",0,"円",243666,"円"]
[null,null,"埼玉県",33,"久喜市立太田小学校",3,"回","2018-10-01","2018-10-22","2018-12-10","岡島　敦子",1,"音楽","B","　声楽",3,"人",162600,"円",19856,"円",0,"円",182456,"円"]
[null,null,"埼玉県",34,"久喜市立菖蒲東小学校",1,"回","2018-06-13",null,null,"三田　浩則",1,"音楽","D","　パーカッション",3,"人",92600,"円",35701,"円",16480,"円",144781,"円"]
[null,null,"埼玉県",35,"伊奈町立小室小学校",3,"回","2018-06-19","2018-06-20","2018-06-21","小川　正毅",1,"音楽","E","　管楽器",12,"人",335400,"円",69955,"円",50000,"円",455355,"円"]
[null,null,"埼玉県",36,"伊奈町立南小学校",3,"回","2018-10-29","2018-10-30","2018-10-31","小川　正毅",1,"音楽","E","　管楽器",12,"人",335400,"円",70607,"円",50000,"円",456007,"円"]
[null,null,"埼玉県",37,"熊谷市立籠原小学校",2,"回","2018-12-17","2018-12-18",null,"齊藤　才子",6,"伝統芸能","F","　箏",6,"人",185200,"円",52036,"円",50000,"円",287236,"円"]
[null,null,"埼玉県",38,"熊谷市立中条中学校",3,"回","2018-12-04","2018-12-06","2018-12-13","齊藤　才子",6,"伝統芸能","F","　箏",3,"人",162600,"円",36906,"円",0,"円",199506,"円"]
[null,null,"埼玉県",39,"熊谷市立大麻生中学校",1,"回","2018-11-20",null,null,"齊藤　才子",6,"伝統芸能","F","　箏",3,"人",92600,"円",28692,"円",50000,"円",171292,"円"]
[null,null,"埼玉県",40,"熊谷市立佐谷田小学校",1,"回","2018-12-10",null,null,"齊藤　才子",6,"伝統芸能","F","　箏",3,"人",92600,"円",28396,"円",50000,"円",170996,"円"]
[null,null,"埼玉県",41,"熊谷市立桜木小学校",1,"回","2018-12-19",null,null,"齊藤　才子",6,"伝統芸能","F","　箏",3,"人",73400,"円",28248,"円",50000,"円",{"$f":"SUM(R1208:V1208)","v":151648},"円"]
[null,null,"埼玉県",42,"熊谷市立星宮小学校",1,"回","2018-10-31",null,null,"齊藤　才子",6,"伝統芸能","F","　箏",3,"人",73400,"円",28618,"円",0,"円",{"$f":"SUM(R1209:V1209)","v":102018},"円"]
[null,null,"埼玉県",43,"朝霞市立第九小学校",2,"回","2018-10-17","2018-10-18",null,"小川　正毅",1,"音楽","E","　管楽器",8,"人",223600,"円",40449,"円",50000,"円",{"$f":"SUM(R1210:V1210)","v":314049},"円"]
[null,null,"埼玉県",44,"鶴ヶ島市立西中学校",3,"回","2018-05-12","2018-06-02","2018-06-09","野上　博幸",1,"音楽","E","　管楽器",0,"人",105000,"円",4620,"円",0,"円",{"$f":"SUM(R1211:V1211)","v":109620},"円"]
[null,null,"埼玉県",45,"狭山市立狭山台中学校",3,"回","2018-06-07","2018-07-10","2018-10-22","濱口　裕輔",1,"音楽","E","　管楽器",0,"人",105000,"円",3960,"円",0,"円",{"$f":"SUM(R1212:V1212)","v":108960},"円"]

{"sheet":"分野（様式反映用）","index":8,"n_rows":11,"n_cols":12,"rows_kept":11,"cut":false,"hidden":true,"merged":[]}
[]
[null,null,null,"音楽","演劇","舞踊","大衆芸能","美術","伝統芸能","文学","生活文化","メディア芸術"]
[1,"音楽",null,"A　ピアノ","A　現代劇","A　バレエ","A　落語","A　洋画","A　歌舞伎","A　俳句","A　囲碁","A　メディアアート"]
[2,"演劇",null,"B　声楽","B　ミュージカル","B　現代舞踊","B　講談","B　日本画","B　能楽","B　朗読","B　将棋","B　映画"]
[3,"舞踊",null,"C　弦楽器","C　人形劇","C　身体表現","C　漫才","C　版画","C　人形浄瑠璃","C　その他","C　華道","C　アニメーション"]
[4,"大衆芸能",null,"D　パーカッション","D　その他","D　その他","D　浪曲","D　彫刻","D　日本舞踊",null,"D　茶道","D　マンガ"]
[5,"美術",null,"E　管楽器",null,null,"E　その他","E　書","E　和太鼓",null,"E　和装","E　その他"]
[6,"伝統芸能",null,"F　その他",null,null,null,"F　写真","F　箏",null,"F　食文化"]
[7,"文学",null,null,null,null,null,"G　その他","G　三味線",null,"G　その他"]
[8,"生活文化",null,null,null,null,null,null,"H　その他"]
[9,"メディア芸術"]