{"text_format":"1","workbook":"xlsx","n_sheets":18,"sheets":["【様式２・３】実施希望調書","【様式2・3】集計用補助シート","【様式９・１０】実施報告書","【様式9・10】集計用補助シート","【様式４】講師","【様式４】補助者①","【様式４】補助者②","【様式４】補助者③","【様式４】補助者④","【様式４】補助者⑤","【様式４】補助者⑥","【様式４】補助者⑦","【様式４】補助者⑧","CopySource【様式４】補助者","【分野】","（様式2・3）集約用","（様式9・10）集約用","選択肢"],"not_rendered":{"charts":0,"images":2,"macros":1,"external_links":0,"defined_names":34,"comments":2,"pivot_tables":0},"unopened":[],"bounds":{"document_bytes":16777216,"sheet_cells":100000,"rows_first":2000,"rows_last":500,"rows_between":2000,"halvings":0,"cell_chars":16384,"cell_head_chars":4096},"cells_cut":0,"cells_raw":0,"read":"whole","date_system":"1900"}

{"sheet":"【様式２・３】実施希望調書","index":0,"n_rows":129,"n_cols":34,"rows_kept":129,"cut":false,"hidden":false,"merged":[[0,24,0,26],[30,1,39,3],[51,24,51,25],[10,0,10,3],[13,0,13,3],[13,5,13,7],[13,9,13,29],[12,8,12,11],[12,12,12,29],[11,0,12,3],[11,4,11,7],[11,8,11,11],[11,12,11,29],[12,4,12,7],[16,0,16,3],[45,4,45,14],[35,11,35,12],[36,19,36,20],[36,21,36,22],[39,11,39,24],[46,11,47,14],[16,4,16,14],[17,0,17,3],[15,0,15,3],[67,26,67,29],[56,24,56,25],[54,19,54,20],[54,21,54,22],[53,14,53,15],[53,16,53,17],[53,19,53,20],[66,4,66,10],[66,11,66,25],[58,1,58,29],[59,1,59,29],[64,9,65,10],[48,1,57,3],[49,11,49,12],[49,14,49,15],[49,16,49,17],[49,19,49,20],[49,21,49,22],[49,24,49,25],[48,4,48,10],[48,11,48,25],[50,5,50,10],[62,18,62,29],[64,1,65,3],[10,4,10,14],[10,15,10,18],[49,26,49,29],[57,5,57,9],[39,5,39,9],[56,19,56,20],[56,21,56,22],[52,5,52,10],[52,11,52,12],[52,14,52,15],[52,16,52,17],[52,19,52,20],[52,21,52,22],[51,5,51,10],[51,11,51,12],[51,14,51,15],[51,16,51,17],[51,19,51,20],[51,21,51,22],[50,11,50,12],[53,21,53,22],[53,24,53,25],[53,26,53,29],[15,4,15,18],[78,0,78,29],[32,5,32,10],[33,5,33,10],[34,5,34,10],[35,5,35,10],[46,9,47,10],[53,5,53,10],[60,0,77,0],[60,1,60,3],[60,4,60,14],[62,1,62,3],[63,1,63,3],[63,21,63,29],[44,4,44,14],[44,15,44,17],[44,18,44,29],[46,15,46,29],[47,15,47,17],[47,18,47,29],[63,4,63,14],[63,15,63,20],[64,11,65,14],[32,11,32,12],[67,24,67,25],[79,0,79,29],[80,0,80,29],[81,0,81,29],[82,0,82,29],[83,0,83,29],[24,15,24,17],[24,18,24,23],[18,4,18,29],[21,4,21,29],[24,4,24,14],[41,1,41,29],[40,1,40,29],[24,0,41,0],[18,0,23,3],[19,4,19,21],[19,22,19,26],[19,27,19,29],[27,21,27,29],[25,14,25,17],[25,21,25,28],[28,11,29,14],[27,4,27,14],[27,15,27,20],[57,11,57,24],[0,0,0,2],[17,15,17,17],[0,27,0,28],[1,0,1,29],[2,0,2,29],[3,0,3,3],[3,4,3,12],[3,13,3,29],[6,0,6,3],[6,4,6,18],[5,0,5,3],[5,4,5,18],[5,19,6,21],[5,22,6,26],[5,27,6,29],[7,0,8,3],[7,5,7,7],[10,22,10,29],[7,9,7,11],[7,19,7,21],[7,22,7,29],[8,4,8,18],[8,19,8,21],[10,19,10,21],[8,22,8,29],[7,12,7,14],[7,15,7,18],[9,0,9,3],[9,19,9,21],[9,22,9,29],[9,13,9,18],[9,10,9,12],[9,4,9,9],[14,0,14,3],[14,4,14,18],[14,19,15,21],[14,22,15,29],[16,18,16,28],[16,15,16,17],[20,4,20,29],[22,4,22,29],[23,4,23,29],[17,4,17,14],[17,18,17,19],[17,20,17,22],[17,24,17,25],[17,26,17,28],[30,4,30,10],[31,5,31,10],[29,15,29,17],[29,18,29,29],[30,11,30,25],[30,26,30,29],[26,4,26,14],[26,15,26,17],[26,18,26,29],[28,15,28,29],[28,1,29,3],[28,4,29,5],[28,6,29,8],[28,9,29,10],[24,24,24,25],[24,26,24,27],[24,28,24,29],[24,1,24,3],[25,1,25,3],[25,4,25,5],[25,9,25,12],[26,1,26,3],[27,1,27,3],[25,6,25,8],[33,16,33,17],[33,21,33,22],[33,26,33,29],[34,11,34,12],[34,16,34,17],[34,21,34,22],[34,26,34,29],[31,21,31,22],[31,26,31,29],[32,21,32,22],[31,11,31,12],[31,16,31,17],[32,16,32,17],[46,6,47,8],[52,24,52,25],[52,26,52,29],[53,11,53,12],[35,26,35,29],[31,14,31,15],[32,14,32,15],[33,14,33,15],[34,14,34,15],[35,14,35,15],[31,19,31,20],[32,19,32,20],[33,19,33,20],[34,19,34,20],[35,19,35,20],[31,24,31,25],[32,24,32,25],[33,24,33,25],[34,24,34,25],[35,24,35,25],[32,26,32,29],[35,16,35,17],[35,21,35,22],[33,11,33,12],[64,4,65,5],[64,6,65,8],[24,31,24,32],[42,0,59,0],[42,1,42,3],[42,4,42,14],[42,15,42,17],[42,18,42,23],[42,24,42,25],[42,26,42,27],[42,28,42,29],[42,31,42,32],[43,1,43,3],[43,4,43,5],[43,9,43,12],[43,14,43,17],[43,21,43,28],[44,1,44,3],[45,1,45,3],[45,21,45,29],[46,1,47,3],[46,4,47,5],[37,24,37,25],[37,26,37,29],[67,14,67,15],[67,16,67,17],[67,19,67,20],[67,21,67,22],[66,26,66,29],[67,5,67,10],[67,11,67,12],[60,31,60,32],[61,1,61,3],[61,4,61,5],[61,9,61,12],[61,14,61,17],[61,21,61,28],[66,1,75,3],[60,15,60,17],[60,18,60,23],[60,24,60,25],[60,26,60,27],[60,28,60,29],[64,15,64,29],[65,15,65,17],[65,18,65,29],[62,4,62,14],[62,15,62,17],[69,24,69,25],[69,26,69,29],[68,24,68,25],[68,26,68,29],[68,5,68,10],[68,11,68,12],[68,14,68,15],[68,16,68,17],[68,19,68,20],[68,21,68,22],[69,5,69,10],[69,11,69,12],[69,14,69,15],[69,16,69,17],[69,19,69,20],[69,21,69,22],[71,26,71,29],[73,5,73,10],[73,11,73,12],[73,14,73,15],[73,16,73,17],[73,19,73,20],[73,21,73,22],[73,24,73,25],[72,21,72,22],[72,24,72,25],[72,26,72,29],[73,26,73,29],[72,19,72,20],[71,14,71,15],[71,16,71,17],[71,19,71,20],[71,21,71,22],[71,24,71,25],[118,22,118,23],[118,24,118,28],[114,0,114,5],[114,6,114,11],[114,12,114,16],[114,18,114,21],[84,0,84,2],[85,0,85,29],[94,24,94,28],[88,12,88,15],[87,0,88,3],[87,4,87,7],[87,8,87,11],[87,12,87,15],[87,17,87,22],[87,23,87,29],[88,17,88,19],[88,20,88,29],[88,4,88,7],[88,8,88,11],[94,12,94,16],[93,18,93,22],[94,18,94,22],[93,24,93,28],[126,0,126,17],[126,18,126,26],[126,27,126,29],[39,26,39,29],[91,0,91,5],[91,6,91,11],[91,12,91,17],[91,24,91,29],[91,18,91,23],[92,0,92,5],[92,6,92,11],[119,0,119,5],[119,6,119,11],[119,12,119,16],[119,18,119,21],[119,22,119,23],[119,24,119,28],[120,0,120,5],[120,6,120,11],[120,12,120,16],[120,18,120,21],[95,0,95,5],[120,22,120,23],[120,24,120,28],[36,11,36,12],[36,14,36,15],[36,16,36,17],[36,24,36,25],[121,0,121,23],[121,24,121,28],[113,0,113,5],[113,6,113,11],[113,12,113,17],[113,18,113,21],[113,22,113,23],[113,24,113,29],[117,0,117,5],[117,6,117,11],[117,12,117,16],[117,18,117,21],[117,22,117,23],[117,24,117,28],[118,0,118,5],[118,6,118,11],[118,12,118,16],[118,18,118,21],[54,24,54,25],[54,26,54,29],[50,14,50,15],[50,16,50,17],[50,19,50,20],[50,21,50,22],[50,24,50,25],[50,26,50,29],[92,18,92,22],[56,16,56,17],[77,1,77,29],[70,5,70,10],[70,11,70,12],[70,14,70,15],[70,16,70,17],[70,19,70,20],[70,21,70,22],[70,24,70,25],[70,26,70,29],[71,5,71,10],[51,26,51,29],[92,24,92,28],[92,12,92,16],[71,11,71,12],[76,1,76,29],[74,5,74,10],[116,0,116,5],[116,6,116,11],[116,12,116,16],[116,18,116,21],[116,22,116,23],[115,18,115,21],[115,22,115,23],[95,18,95,22],[96,18,96,22],[96,0,96,5],[96,6,96,11],[96,12,96,16],[105,18,105,22],[104,18,104,22],[105,0,105,5],[114,22,114,23],[100,0,100,5],[100,6,100,11],[99,0,99,5],[99,6,99,11],[104,0,104,5],[101,0,101,5],[102,0,102,5],[103,0,103,5],[93,12,93,16],[95,6,95,11],[95,12,95,16],[93,0,93,5],[93,6,93,11],[94,0,94,5],[94,6,94,11],[96,24,96,28],[95,24,95,28],[74,11,74,12],[74,14,74,15],[74,16,74,17],[74,19,74,20],[74,21,74,22],[74,24,74,25],[74,26,74,29],[75,26,75,29],[75,5,75,9],[75,11,75,24],[116,24,116,28],[55,5,55,10],[55,11,55,12],[55,14,55,15],[55,16,55,17],[55,19,55,20],[55,21,55,22],[55,24,55,25],[55,26,55,29],[56,5,56,10],[56,11,56,12],[56,14,56,15],[106,24,106,28],[57,26,57,29],[72,5,72,10],[72,11,72,12],[72,14,72,15],[72,16,72,17],[105,24,105,28],[104,24,104,28],[105,12,105,16],[104,12,104,16],[105,6,105,11],[104,6,104,11],[115,24,115,28],[97,0,97,5],[97,6,97,11],[98,0,98,5],[98,6,98,11],[99,18,99,22],[100,18,100,22],[106,18,106,22],[106,0,106,11],[98,24,98,28],[97,24,97,28],[99,24,99,28],[100,24,100,28],[97,18,97,22],[98,18,98,22],[97,12,97,16],[98,12,98,16],[99,12,99,16],[114,24,114,28],[115,0,115,5],[115,6,115,11],[115,12,115,16],[100,12,100,16],[106,12,106,16],[36,5,36,10],[56,26,56,29],[38,5,38,10],[38,11,38,12],[38,14,38,15],[38,16,38,17],[38,19,38,20],[38,21,38,22],[38,24,38,25],[38,26,38,29],[54,5,54,10],[54,11,54,12],[54,14,54,15],[54,16,54,17],[48,26,48,29],[49,5,49,10],[45,15,45,20],[36,26,36,29],[37,5,37,10],[37,11,37,12],[37,14,37,15],[37,16,37,17],[37,19,37,20],[37,21,37,22],[102,24,102,28],[103,24,103,28],[101,18,101,22],[102,18,102,22],[103,18,103,22],[101,12,101,16],[102,12,102,16],[103,12,103,16],[101,6,101,11],[102,6,102,11],[103,6,103,11],[101,24,101,28]]}
["様式２",null,null,null,null,null,null,null,null,null,null,null,null,null,null,null,null,null,null,null,null,null,null,null,"応募No.",null,null,null,null,"番"]
[]
["令和4年度文化芸術による子供育成推進事業（芸術家の派遣事業）　実施希望調書（個別表）"]
["都道府県・\n政令指定都市名",null,null,null,"北海道"]
[null,null,null,null,null,null,null,null,null,null,null,null,null,null,null,null,null,null,null,null,null,null,null,null,null,null,null,null,null,"※オレンジセル横の▼をクリックすると選択肢が表示されますので該当するものを選択してください"]
["ふりがな",null,null,null,"○○しりつ　ぶんか　しょうがっこう",null,null,null,null,null,null,null,null,null,null,null,null,null,null,"全校\n児童生徒",null,null,300,null,null,null,null,"人"]
["実施校名",null,null,null,"○○市立文化小学校"]
["実施校所在地",null,null,null,"〒","***",null,null,"-","****",null,null,"都道府県",null,null,"北海道",null,null,null,"学校長名",null,null,"◇◇　◇◇"]
[null,null,null,null,"○○市　△△　1-1-1",null,null,null,null,null,null,null,null,null,null,null,null,null,null,"担当者名",null,null,"□□　□□"]
["TEL",null,null,null,"00-0000-0000",null,null,null,null,null,"FAX",null,null,"00-0000-1111",null,null,null,null,null,"メール",null,null,"xxx@xxxx.xx.xx"]
["実施会場",null,null,null,"実施校の教室・体育館",null,null,null,null,null,null,null,null,null,null,"他校との合同\n開催の状況",null,null,null,"参加学校名",null,null,"なし"]
["実施分野\n（別シート参照）",null,null,null,"大項目",null,null,null,"中項目",null,null,null,"（補足がある場合は記入してください）"]
[null,null,null,null,"音楽",null,null,null,"C　弦楽器"]
["実施回数",null,null,null,"全",{"$f":"COUNTA(E25,E43,E61)","v":3},null,null,"回"]
["ふりがな",null,null,null,"げいじゅつ　はなこ",null,null,null,null,null,null,null,null,null,null,null,null,null,null,"所属団体",null,null,"●●室内管弦楽団"]
["講師氏名\n※本名",null,null,null,"芸術　花子"]
["学校との関係",null,null,null,"卒業生",null,null,null,null,null,null,null,null,null,null,"その他（",null,null,null,null,null,null,null,null,null,null,null,null,null,"）"]
["協力者名簿への登録",null,null,null,"登録済み",null,null,null,null,null,null,null,null,null,null,"連続実施年数",null,null,"同一\n講師",null,2,null,null,"年","同一\n分野",null,4,null,null,"年"]
["連続実施理由\n（令和元年度より数えて4年以上連続で同一講師または同一分野を希望する場合）",null,null,null,"1.　4年以上連続で実施を希望する場合は、次の確認事項をお読みになり、確認したら右側の「確認済み」を選択してください。選択しない場合は申請することができません。"]
[null,null,null,null,"・本校は他の講師での実施についても検討した上で、本申請内容にて申請しています。",null,null,null,null,null,null,null,null,null,null,null,null,null,null,null,null,null,"確認したら選択→",null,null,null,null,"確認済み"]
[null,null,null,null,"2.　4年以上連続で実施する理由として最も当てはまる項目を選択してください"]
[null,null,null,null,"希望する講師が芸術分野以外にも申請校が求める専門スキルを所有しており他の講師での実施が困難（福祉現場での活動経験が豊富等）"]
[null,null,null,null,"3.　具体的な理由を記してください。（100文字以上250文字以内）"]
[null,null,null,null,"本校では毎年、芸術文化の鑑賞や活動体験を通して、子供たちの豊かな情操を育み、芸術に親しむ感性を養うことを目的として芸術家の派遣事業を活用している。本校の児童の特性として、発達に困難を抱えた児童が多く、毎年異なる講師を迎えることは、子供たちへ不安や緊張といったストレスをかける要因となり、本来の目的達成に支障が生じてしまう。本校が希望する○○先生は本校の児童の特性に深く理解があり、教員側・保護者側からも安心して実施をお任せできることから、令和4年度も継続して○○先生を講師に迎えることを希望する。"]
["第１回","実施日時",null,null,"2022-06-10",null,null,null,null,null,null,null,null,null,null,"実施時間",null,null,"午前",null,null,null,null,null,"実施\n合計",null,90,null,"分",null,null,{"$f":"IF(AA25>=150,3,IF(AND(AA25<150,AA25>=90),2,IF(AA25=\"\",0,1)))","v":2},null,"時間分の謝金計上可"]
[null,"連続する実施",null,null,"有",null,"有の場合→",null,null,"都道府県・\n政令指定都市名",null,null,null,"　（","北海道",null,null,null,"）","学校名（",null,"◎◎市立芸術中学校",null,null,null,null,null,null,null,"）"]
[null,"教科の\n位置付け",null,null,"教科",null,null,null,null,null,null,null,null,null,null,{"$f":"IFERROR(VLOOKUP(E27,選択肢!$Z$2:$AA$6,2,FALSE),\"\")","v":"教科名"},null,null,"音楽"]
[null,"著作権",null,null,"許諾が必要",null,null,null,null,null,null,null,null,null,null,{"$f":"IF(E28<>\"許諾が必要\",\"\",\"→必要な場合は\")","v":"→必要な場合は"},null,null,null,null,null,"許諾取得済み"]
[null,"参加\n児童生徒",null,null,"合計",null,100,null,null,"人",null,"参加児童\n生徒単位",null,null,null,"学年単位"]
[null,null,null,null,null,null,null,null,null,null,null,null,null,null,null,{"$f":"IFERROR(VLOOKUP(P29,選択肢!AE2:AF4,2,FALSE),\"\")","v":"内訳"},null,null,"5，6年生"]
[null,"補助者",null,null,"氏名   ※本名",null,null,null,null,null,null,"種別・従事時間",null,null,null,null,null,null,null,null,null,null,null,null,null,null,"謝金合計"]
[null,null,null,null,"①","次代　太郎",null,null,null,null,null,"演奏",null,1,"時間",null,"実技指導",null,1,"時間",null,"単純労務",null,null,"時間",null,{"$f":"(N32*6520)+(S32*5200)+(X32*1070)","v":11720},null,null,null,null,{"$f":"IF(N32+S32>$AF$25,\"謝金計上可能上限時間を超えています。\",\"\")","v":""}]
[null,null,null,null,"②","音楽　花子",null,null,null,null,null,"演奏",null,1,"時間",null,"実技指導",null,1,"時間",null,"単純労務",null,null,"時間",null,{"$f":"(N33*6520)+(S33*5200)+(X33*1070)","v":11720},null,null,null,null,""]
[null,null,null,null,"③","演奏　太郎",null,null,null,null,null,"演奏",null,1,"時間",null,"実技指導",null,1,"時間",null,"単純労務",null,null,"時間",null,{"$f":"(N34*6520)+(S34*5200)+(X34*1070)","v":11720},null,null,null,null,""]
[null,null,null,null,"④",null,null,null,null,null,null,"演奏",null,null,"時間",null,"実技指導",null,null,"時間",null,"単純労務",null,null,"時間",null,{"$f":"(N35*6520)+(S35*5200)+(X35*1070)","v":0},null,null,null,null,{"$f":"IF(N35+S35>$AF$25,\"謝金計上可能上限時間を超えています。\",\"\")","v":""}]
[null,null,null,null,"⑤",null,null,null,null,null,null,"演奏",null,null,"時間",null,"実技指導",null,null,"時間",null,"単純労務",null,null,"時間",null,{"$f":"(N36*6520)+(S36*5200)+(X36*1070)","v":0},null,null,null,null,""]
[null,null,null,null,"⑥",null,null,null,null,null,null,"演奏",null,null,"時間",null,"実技指導",null,null,"時間",null,"単純労務",null,null,"時間",null,{"$f":"IF(OR(OR(AND($E$11=\"文化施設等\",$W$11=\"\"),AND($E$11=\"文化施設等\",$W$11=\"なし\"),$E$11<>\"文化施設等\")),0,(N37*6520)+(S37*5200)+(X37*1070))","v":0},null,null,null,null,""]
[null,null,null,null,"⑦",null,null,null,null,null,null,"演奏",null,null,"時間",null,"実技指導",null,null,"時間",null,"単純労務",null,null,"時間",null,{"$f":"IF(OR(OR(AND($E$11=\"文化施設等\",$W$11=\"\"),AND($E$11=\"文化施設等\",$W$11=\"なし\"),$E$11<>\"文化施設等\")),0,(N38*6520)+(S38*5200)+(X38*1070))","v":0},null,null,null,null,""]
[null,null,null,null,"⑧",null,null,null,null,null,null,"演奏",null,null,"時間",null,"実技指導",null,null,"時間",null,"単純労務",null,null,"時間",null,{"$f":"IF(OR(OR(AND($E$11=\"文化施設等\",$W$11=\"\"),AND($E$11=\"文化施設等\",$W$11=\"なし\"),$E$11<>\"文化施設等\")),0,(N39*6520)+(S39*5200)+(X39*1070))","v":0},null,null,null,null,""]
[null,null,null,null,"計",{"$f":"IF(OR(OR(AND($E$11=\"文化施設等\",$W$11=\"\"),AND($E$11=\"文化施設等\",$W$11=\"なし\"),$E$11<>\"文化施設等\")),COUNTIF(F32:F36,\"?*\"),COUNTIF(F32:F39,\"?*\"))","v":3},null,null,null,null,"人","※各1時間当たり　演奏6,520円、実技指導5,200円、単純労務1,070円",null,null,null,null,null,null,null,null,null,null,null,null,null,"計",{"$f":"SUM(AA32:AD39)","v":35160}]
[null,"  事業内容  （具体的な内容をお書きください）"]
[null,"○○○○○○○○○○○○○○○○○○○○○○○○○○○○○○○○○○○○○○○○○○○○○○○○○○○○○○○○○○○○○○○○○○○○○○○○○○○○○○○○○○○○○○○○○○○○○○○○○○○○○○○○○○○○○○○○○○○○○○○○○○○○○○○○○○○○○○○○○○○○○○○○○○○○○○○○○○○○○○○○○○○○○○○○○○○○"]
["第2回","実施日時",null,null,"2022-06-17",null,null,null,null,null,null,null,null,null,null,"実施時間",null,null,"午後",null,null,null,null,null,"実施\n合計",null,150,null,"分",null,null,{"$f":"IF(AA43>=150,3,IF(AND(AA43<150,AA43>=90),2,IF(AA43=\"\",0,1)))","v":3},null,"時間分の謝金計上可"]
[null,"連続する実施",null,null,"無",null,"有の場合→",null,null,"都道府県・\n政令指定都市名",null,null,null,"　（",null,null,null,null,"）","学校名（",null,null,null,null,null,null,null,null,null,"）"]
[null,"教科の\n位置付け",null,null,"総合的な学習の時間",null,null,null,null,null,null,null,null,null,null,{"$f":"IFERROR(VLOOKUP(E45,選択肢!$Z$2:$AA$6,2,FALSE),\"\")","v":"　"}]
[null,"著作権",null,null,"許諾は不要",null,null,null,null,null,null,null,null,null,null,{"$f":"IF(E46<>\"許諾が必要\",\"\",\"→必要な場合は\")","v":""}]
[null,"参加\n児童生徒",null,null,"合計",null,100,null,null,"人",null,"参加児童\n生徒単位",null,null,null,"学年単位"]
[null,null,null,null,null,null,null,null,null,null,null,null,null,null,null,{"$f":"IFERROR(VLOOKUP(P47,選択肢!AE2:AF4,2,FALSE),\"\")","v":"内訳"},null,null,"5，6年生"]
[null,"補助者",null,null,"氏名   ※本名",null,null,null,null,null,null,"種別・従事時間",null,null,null,null,null,null,null,null,null,null,null,null,null,null,"謝金合計"]
[null,null,null,null,"①",{"$f":"IF($E$43=\"\",\"\",IF(F32=\"\",\"\",F32))","v":"次代　太郎"},null,null,null,null,null,"演奏",null,2,"時間",null,"実技指導",null,1,"時間",null,"単純労務",null,null,"時間",null,{"$f":"(N50*6520)+(S50*5200)+(X50*1070)","v":18240},null,null,null,null,{"$f":"IF(N50+S50>$AF$43,\"謝金計上可能上限時間を超えています。\",\"\")","v":""}]
[null,null,null,null,"②",{"$f":"IF($E$43=\"\",\"\",IF(F33=\"\",\"\",F33))","v":"音楽　花子"},null,null,null,null,null,"演奏",null,2,"時間",null,"実技指導",null,1,"時間",null,"単純労務",null,null,"時間",null,{"$f":"(N51*6520)+(S51*5200)+(X51*1070)","v":18240},null,null,null,null,{"$f":"IF(N51+S51>$AF$43,\"謝金計上可能上限時間を超えています。\",\"\")","v":""}]
[null,null,null,null,"③",{"$f":"IF($E$43=\"\",\"\",IF(F34=\"\",\"\",F34))","v":"演奏　太郎"},null,null,null,null,null,"演奏",null,2,"時間",null,"実技指導",null,1,"時間",null,"単純労務",null,null,"時間",null,{"$f":"(N52*6520)+(S52*5200)+(X52*1070)","v":18240},null,null,null,null,""]
[null,null,null,null,"④",{"$f":"IF($E$43=\"\",\"\",IF(F35=\"\",\"\",F35))","v":""},null,null,null,null,null,"演奏",null,null,"時間",null,"実技指導",null,null,"時間",null,"単純労務",null,null,"時間",null,{"$f":"(N53*6520)+(S53*5200)+(X53*1070)","v":0},null,null,null,null,""]
[null,null,null,null,"⑤",{"$f":"IF($E$43=\"\",\"\",IF(F36=\"\",\"\",F36))","v":""},null,null,null,null,null,"演奏",null,null,"時間",null,"実技指導",null,null,"時間",null,"単純労務",null,null,"時間",null,{"$f":"(N54*6520)+(S54*5200)+(X54*1070)","v":0},null,null,null,null,""]
[null,null,null,null,"⑥",{"$f":"IF(OR(OR(AND($E$11=\"文化施設等\",$W$11=\"\"),AND($E$11=\"文化施設等\",$W$11=\"なし\"),$E$11<>\"文化施設等\")),\"\",IF($E$43=\"\",\"\",IF(F37=\"\",\"\",F37)))","v":""},null,null,null,null,null,"演奏",null,null,"時間",null,"実技指導",null,null,"時間",null,"単純労務",null,null,"時間",null,{"$f":"IF(OR(OR(AND($E$11=\"文化施設等\",$W$11=\"\"),AND($E$11=\"文化施設等\",$W$11=\"なし\"),$E$11<>\"文化施設等\")),0,(N55*6520)+(S55*5200)+(X55*1070))","v":0},null,null,null,null,""]
[null,null,null,null,"⑦",{"$f":"IF(OR(OR(AND($E$11=\"文化施設等\",$W$11=\"\"),AND($E$11=\"文化施設等\",$W$11=\"なし\"),$E$11<>\"文化施設等\")),\"\",IF($E$43=\"\",\"\",IF(F38=\"\",\"\",F38)))","v":""},null,null,null,null,null,"演奏",null,null,"時間",null,"実技指導",null,null,"時間",null,"単純労務",null,null,"時間",null,{"$f":"IF(OR(OR(AND($E$11=\"文化施設等\",$W$11=\"\"),AND($E$11=\"文化施設等\",$W$11=\"なし\"),$E$11<>\"文化施設等\")),0,(N56*6520)+(S56*5200)+(X56*1070))","v":0},null,null,null,null,""]
[null,null,null,null,"⑧",{"$f":"IF(OR(OR(AND($E$11=\"文化施設等\",$W$11=\"\"),AND($E$11=\"文化施設等\",$W$11=\"なし\"),$E$11<>\"文化施設等\")),\"\",IF($E$43=\"\",\"\",IF(F39=\"\",\"\",F39)))","v":""},null,null,null,null,null,"演奏",null,null,"時間",null,"実技指導",null,null,"時間",null,"単純労務",null,null,"時間",null,{"$f":"IF(OR(OR(AND($E$11=\"文化施設等\",$W$11=\"\"),AND($E$11=\"文化施設等\",$W$11=\"なし\"),$E$11<>\"文化施設等\")),0,(N57*6520)+(S57*5200)+(X57*1070))","v":0},null,null,null,null,""]
[null,null,null,null,"計",{"$f":"IF(OR(OR(AND($E$11=\"文化施設等\",$W$11=\"\"),AND($E$11=\"文化施設等\",$W$11=\"なし\"),$E$11<>\"文化施設等\")),COUNTIF(F50:F54,\"?*\"),COUNTIF(F50:F57,\"?*\"))","v":3},null,null,null,null,"人","※各1時間当たり　演奏6,520円、実技指導5,200円、単純労務1,070円",null,null,null,null,null,null,null,null,null,null,null,null,null,"計",{"$f":"SUM(AA50:AD57)","v":54720}]
[null,"  事業内容  （具体的な内容をお書きください）"]
[null,"○○○○○○○○○○○○○○○○○○○○○○○○○○○○○○○○○○○○○○○○○○○○○○○○○○○○○○○○○○○○○○○○○○○○○○○○○○○○○○○○○○○○○○○○○○○○○○○○○○○○○○○○○○○○○○○○○○○○○○○○○○○○○○○○○○○○○○○○○○○○○○○○○○○○○○○○○○○○○○○○○○○○○○○○○○○○"]
["第3回","実施日時",null,null,"2022-06-23",null,null,null,null,null,null,null,null,null,null,"実施時間",null,null,"午前と午後",null,null,null,null,null,"実施\n合計",null,150,null,"分",null,null,{"$f":"IF(AA61>=150,3,IF(AND(AA61<150,AA61>=90),2,IF(AA61=\"\",0,1)))","v":3},null,"時間分の謝金計上可"]
[null,"連続する実施",null,null,"無",null,"有の場合→",null,null,"都道府県・\n政令指定都市名",null,null,null,"　（",null,null,null,null,"）","学校名（",null,null,null,null,null,null,null,null,null,"）"]
[null,"教科の\n位置付け",null,null,"特別活動",null,null,null,null,null,null,null,null,null,null,{"$f":"IFERROR(VLOOKUP(E63,選択肢!$Z$2:$AA$6,2,FALSE),\"\")","v":"特別活動名"},null,null,"文化的行事"]
[null,"著作権",null,null,"許諾が必要",null,null,null,null,null,null,null,null,null,null,{"$f":"IF(E64<>\"許諾が必要\",\"\",\"→必要な場合は\")","v":"→必要な場合は"},null,null,null,null,null,"許諾未取得"]
[null,"参加\n児童生徒",null,null,"合計",null,300,null,null,"人",null,"参加児童\n生徒単位",null,null,null,"全校児童/生徒"]
[null,null,null,null,null,null,null,null,null,null,null,null,null,null,null,{"$f":"IFERROR(VLOOKUP(P65,選択肢!AE2:AF4,2,FALSE),\"\")","v":""}]
[null,"補助者",null,null,"氏名   ※本名",null,null,null,null,null,null,"種別・従事時間",null,null,null,null,null,null,null,null,null,null,null,null,null,null,"謝金合計"]
[null,null,null,null,"①",{"$f":"IF($E$61=\"\",\"\",IF(F32=\"\",\"\",F32))","v":"次代　太郎"},null,null,null,null,null,"演奏",null,2,"時間",null,"実技指導",null,1,"時間",null,"単純労務",null,null,"時間",null,{"$f":"(N68*6520)+(S68*5200)+(X68*1070)","v":18240},null,null,null,null,{"$f":"IF(N68+S68>$AF$61,\"謝金計上可能上限時間を超えています。\",\"\")","v":""}]
[null,null,null,null,"②",{"$f":"IF($E$61=\"\",\"\",IF(F33=\"\",\"\",F33))","v":"音楽　花子"},null,null,null,null,null,"演奏",null,2,"時間",null,"実技指導",null,null,"時間",null,"単純労務",null,null,"時間",null,{"$f":"(N69*6520)+(S69*5200)+(X69*1070)","v":13040},null,null,null,null,""]
[null,null,null,null,"③",{"$f":"IF($E$61=\"\",\"\",IF(F34=\"\",\"\",F34))","v":"演奏　太郎"},null,null,null,null,null,"演奏",null,2,"時間",null,"実技指導",null,null,"時間",null,"単純労務",null,null,"時間",null,{"$f":"(N70*6520)+(S70*5200)+(X70*1070)","v":13040},null,null,null,null,""]
[null,null,null,null,"④","弦楽　花子",null,null,null,null,null,"演奏",null,2,"時間",null,"実技指導",null,null,"時間",null,"単純労務",null,null,"時間",null,{"$f":"(N71*6520)+(S71*5200)+(X71*1070)","v":13040},null,null,null,null,""]
[null,null,null,null,"⑤","鍵盤　太郎",null,null,null,null,null,"演奏",null,2,"時間",null,"実技指導",null,null,"時間",null,"単純労務",null,null,"時間",null,{"$f":"(N72*6520)+(S72*5200)+(X72*1070)","v":13040},null,null,null,null,""]
[null,null,null,null,"⑥",{"$f":"IF(OR(OR(AND($E$11=\"文化施設等\",$W$11=\"\"),AND($E$11=\"文化施設等\",$W$11=\"なし\"),$E$11<>\"文化施設等\")),\"\",IF($E$61=\"\",\"\",IF(F37=\"\",\"\",F37)))","v":""},null,null,null,null,null,"演奏",null,null,"時間",null,"実技指導",null,null,"時間",null,"単純労務",null,null,"時間",null,{"$f":"IF(OR(OR(AND($E$11=\"文化施設等\",$W$11=\"\"),AND($E$11=\"文化施設等\",$W$11=\"なし\"),$E$11<>\"文化施設等\")),0,(N73*6520)+(S73*5200)+(X73*1070))","v":0},null,null,null,null,""]
[null,null,null,null,"⑦",{"$f":"IF(OR(OR(AND($E$11=\"文化施設等\",$W$11=\"\"),AND($E$11=\"文化施設等\",$W$11=\"なし\"),$E$11<>\"文化施設等\")),\"\",IF($E$61=\"\",\"\",IF(F38=\"\",\"\",F38)))","v":""},null,null,null,null,null,"演奏",null,null,"時間",null,"実技指導",null,null,"時間",null,"単純労務",null,null,"時間",null,{"$f":"IF(OR(OR(AND($E$11=\"文化施設等\",$W$11=\"\"),AND($E$11=\"文化施設等\",$W$11=\"なし\"),$E$11<>\"文化施設等\")),0,(N74*6520)+(S74*5200)+(X74*1070))","v":0},null,null,null,null,""]
[null,null,null,null,"⑧",{"$f":"IF(OR(OR(AND($E$11=\"文化施設等\",$W$11=\"\"),AND($E$11=\"文化施設等\",$W$11=\"なし\"),$E$11<>\"文化施設等\")),\"\",IF($E$61=\"\",\"\",IF(F39=\"\",\"\",F39)))","v":""},null,null,null,null,null,"演奏",null,null,"時間",null,"実技指導",null,null,"時間",null,"単純労務",null,null,"時間",null,{"$f":"IF(OR(OR(AND($E$11=\"文化施設等\",$W$11=\"\"),AND($E$11=\"文化施設等\",$W$11=\"なし\"),$E$11<>\"文化施設等\")),0,(N75*6520)+(S75*5200)+(X75*1070))","v":0},null,null,null,null,{"$f":"IF(N75+S75>$AF$61,\"謝金計上可能上限時間を超えています。\",\"\")","v":""}]
[null,null,null,null,"計",{"$f":"IF(OR(OR(AND($E$11=\"文化施設等\",$W$11=\"\"),AND($E$11=\"文化施設等\",$W$11=\"なし\"),$E$11<>\"文化施設等\")),COUNTIF(F68:F72,\"?*\"),COUNTIF(F68:F75,\"?*\"))","v":5},null,null,null,null,"人","※各1時間当たり　演奏6,520円、実技指導5,200円、単純労務1,070円",null,null,null,null,null,null,null,null,null,null,null,null,null,"計",{"$f":"SUM(AA68:AD75)","v":70400}]
[null,"  事業内容  （具体的な内容をお書きください）"]
[null,"○○○○○○○○○○○○○○○○○○○○○○○○○○○○○○○○○○○○○○○○○○○○○○○○○○○○○○○○○○○○○○○○○○○○○○○○○○○○○○○○○○○○○○○○○○○○○○○○○○○○○○○○○○○○○○○○○○○○○○○○○○○○○○○○○○○○○○○○○○○○○○○○○○○○○○○○○○○○○○○○○○○○○○○○○○○○"]
["※実施分野は別シート【分野】を参照し、大項目、中項目を選択してください"]
["※他校と合同で実施する場合は、参加児童生徒単位欄で「その他」を選択し、下段内に他校の参加人数を記入してください"]
["※様式の枠内に収まらない場合は、別紙を作成し添付してください"]
["※連続実施理由は、令和元年度以降4年以上連続で同一講師を希望する場合、具体的な理由を明記してください"]
["※本事業で得た個人情報は、本事業内のみで使用します"]
["※本事業の専用ウェブページにある[個人情報について]に同意していただいたものとします"]
["様式３"]
["令和4年度文化芸術による子供育成推進事業（芸術家の派遣事業）　経費計画書"]
[]
["実施日",null,null,null,"第１回",null,null,null,"第２回",null,null,null,"第３回",null,null,null,null,"都道府県・政令指定都市",null,null,null,null,null,{"$f":"IF(E4=\"\",\"\",E4)","v":"北海道"}]
[null,null,null,null,{"$f":"IF(E25=\"\",\"\",E25)","v":"2022-06-10"},null,null,null,{"$f":"IF(E43=\"\",\"\",E43)","v":"2022-06-17"},null,null,null,{"$f":"IF(E61=\"\",\"\",E61)","v":"2022-06-23"},null,null,null,null,"実施校名",null,null,{"$f":"IF(E7=\"\",\"\",E7)","v":"○○市立文化小学校"}]
[]
["【謝金・旅費】",null,null,null,null,null,"※補助者氏名が自動反映されない場合は、氏名欄の▼プルダウンリストから選択してください"]
["種別",null,null,null,null,null,"氏名　※本名",null,null,null,null,null,"謝金（a）",null,null,null,null,null,"旅費（ｂ）",null,null,null,null,null,"合計"]
["講師",null,null,null,null,null,{"$f":"IF($E$16=\"\",\"\",$E$16)","v":"芸術　花子"},null,null,null,null,null,{"$f":"IF(G93=\"\",0,F14*35650)","v":106950},null,null,null,null,"円",37880,null,null,null,null,"円",{"$f":"IFERROR(M93+S93,0)","v":144830},null,null,null,null,"円"]
["補助者①",null,null,null,null,null,{"$f":"IF($F$32=\"\",\"　\",$F$32)","v":"次代　太郎"},null,null,null,null,null,{"$f":"SUM(IFERROR(VLOOKUP(G94,$F$32:$AD$39,22,FALSE),0),IFERROR(VLOOKUP(G94,$F$50:$AD$57,22,FALSE),0),IFERROR(VLOOKUP(G94,$F$68:$AD$75,22,FALSE),0))","v":48200},null,null,null,null,"円",3000,null,null,null,null,"円",51200,null,null,null,null,"円"]
["補助者②",null,null,null,null,null,{"$f":"IF($F$33=\"\",\"　\",$F$33)","v":"音楽　花子"},null,null,null,null,null,43000,null,null,null,null,"円",21300,null,null,null,null,"円",64300,null,null,null,null,"円"]
["補助者③",null,null,null,null,null,{"$f":"IF($F$34=\"\",\"　\",$F$34)","v":"演奏　太郎"},null,null,null,null,null,43000,null,null,null,null,"円",1200,null,null,null,null,"円",44200,null,null,null,null,"円"]
["補助者④",null,null,null,null,null,"弦楽　花子",null,null,null,null,null,13040,null,null,null,null,"円",0,null,null,null,null,"円",13040,null,null,null,null,"円"]
["補助者⑤",null,null,null,null,null,"鍵盤　太郎",null,null,null,null,null,13040,null,null,null,null,"円",2210,null,null,null,null,"円",15250,null,null,null,null,"円"]
["補助者⑥",null,null,null,null,null,{"$f":"IF(OR(OR(AND($E$11=\"文化施設等\",$W$11=\"\"),AND($E$11=\"文化施設等\",$W$11=\"なし\"),$E$11<>\"文化施設等\")),\"　\",IF($F$37=\"\",\"　\",$F$37))","v":"　"},null,null,null,null,null,0,null,null,null,null,"円",null,null,null,null,null,"円",0,null,null,null,null,"円"]
["補助者⑦",null,null,null,null,null,{"$f":"IF(OR(OR(AND($E$11=\"文化施設等\",$W$11=\"\"),AND($E$11=\"文化施設等\",$W$11=\"なし\"),$E$11<>\"文化施設等\")),\"　\",IF($F$38=\"\",\"　\",$F$38))","v":"　"},null,null,null,null,null,0,null,null,null,null,"円",null,null,null,null,null,"円",0,null,null,null,null,"円"]
["補助者⑧",null,null,null,null,null,{"$f":"IF(OR(OR(AND($E$11=\"文化施設等\",$W$11=\"\"),AND($E$11=\"文化施設等\",$W$11=\"なし\"),$E$11<>\"文化施設等\")),\"　\",IF($F$39=\"\",\"　\",$F$39))","v":"　"},null,null,null,null,null,{"$f":"SUM(IFERROR(VLOOKUP(G101,$F$32:$AD$39,22,FALSE),0),IFERROR(VLOOKUP(G101,$F$50:$AD$57,22,FALSE),0),IFERROR(VLOOKUP(G101,$F$68:$AD$75,22,FALSE),0))","v":0},null,null,null,null,"円",null,null,null,null,null,"円",0,null,null,null,null,"円"]
["補助者⑨",null,null,null,null,null,"　",null,null,null,null,null,{"$f":"SUM(IFERROR(VLOOKUP(G102,$F$32:$AD$39,22,FALSE),0),IFERROR(VLOOKUP(G102,$F$50:$AD$57,22,FALSE),0),IFERROR(VLOOKUP(G102,$F$68:$AD$75,22,FALSE),0))","v":0},null,null,null,null,"円",null,null,null,null,null,"円",{"$f":"IFERROR(M102+S102,0)","v":0},null,null,null,null,"円"]
["補助者⑩",null,null,null,null,null," ",null,null,null,null,null,0,null,null,null,null,"円",null,null,null,null,null,"円",{"$f":"IFERROR(M103+S103,0)","v":0},null,null,null,null,"円"]
["補助者⑪",null,null,null,null,null," ",null,null,null,null,null,0,null,null,null,null,"円",null,null,null,null,null,"円",{"$f":"IFERROR(M104+S104,0)","v":0},null,null,null,null,"円"]
["補助者⑫",null,null,null,null,null," ",null,null,null,null,null,0,null,null,null,null,"円",null,null,null,null,null,"円",{"$f":"IFERROR(M105+S105,0)","v":0},null,null,null,null,"円"]
["補助者⑬",null,null,null,null,null," ",null,null,null,null,null,0,null,null,null,null,"円",null,null,null,null,null,"円",{"$f":"IFERROR(M106+S106,0)","v":0},null,null,null,null,"円"]
["謝金合計（ａ）＋旅費合計（ｂ）",null,null,null,null,null,null,null,null,null,null,null,{"$f":"SUM(M93:Q106)","v":267230},null,null,null,null,"円",{"$f":"SUM(S93:W106)","v":65590},null,null,null,null,"円",{"$f":"SUM(Y93:AC106)","v":332820},null,null,null,null,"円"]
["※講師謝金は1回あたり35,650円で自動計算・反映されます"]
["※補助者謝金は1時間当たり　演奏6,520円、実技指導5,200円、単純労務1,070円　で自動計算・反映されます"]
["※被派遣者毎に、様式4旅費計算書の合計金額を記入してください"]
["※旅費が0円の場合も記入してください"]
[]
["【講演等諸雑費】"]
["種別",null,null,null,null,null,"項目または業者名",null,null,null,null,null,"単価",null,null,null,null,null,"数量",null,null,null,"（単位）",null,"合計"]
["運搬費",null,null,null,null,null,"○○運搬株式会社",null,null,null,null,null,10000,null,null,null,null,"円",3,null,null,null,"回",null,{"$f":"M115*S115","v":30000},null,null,null,null,"円"]
["著作権使用料",null,null,null,null,null,"一般社団法人○○○協会",null,null,null,null,null,1100,null,null,null,null,"円",2,null,null,null,"回",null,2200,null,null,null,null,"円"]
["レンタル費",null,null,null,null,null,"有限会社○○楽器",null,null,null,null,null,1650,null,null,null,null,"円",10,null,null,null,"式",null,16500,null,null,null,null,"円"]
[null,null,null,null,null,null,null,null,null,null,null,null,null,null,null,null,null,"円",null,null,null,null,null,null,0,null,null,null,null,"円"]
[null,null,null,null,null,null,null,null,null,null,null,null,null,null,null,null,null,"円",null,null,null,null,null,null,0,null,null,null,null,"円"]
[null,null,null,null,null,null,null,null,null,null,null,null,null,null,null,null,null,"円",null,null,null,null,null,null,0,null,null,null,null,"円"]
[null,null,null,null,null,null,null,null,null,null,null,null,null,null,null,null,null,"円",null,null,null,null,null,null,0,null,null,null,null,"円"]
["講演等諸雑費合計（ｃ）",null,null,null,null,null,null,null,null,null,null,null,null,null,null,null,null,null,null,null,null,null,null,null,{"$f":"SUM(Y115:AC121)","v":48700},null,null,null,null,"円"]
["※種別：「運搬費」「消耗品」「レンタル費」「著作権使用料」のいずれかを選択してください"]
["※金額の根拠書類（業者からの見積書）を添付してください"]
["※決定通知以降の項目変更や、見積業者からの変更は認められません"]
[]
["総合計（ａ＋ｂ＋ｃ）",null,null,null,null,null,null,null,null,null,null,null,null,null,null,null,null,null,{"$f":"Y107+Y122","v":381520},null,null,null,null,null,null,null,null,"円"]
["※本事業で得た個人情報は、本事業内のみで使用します"]
["※本事業の専用ウェブページにある[個人情報について]に同意していただいたものとします"]

{"sheet":"【様式2・3】集計用補助シート","index":1,"n_rows":14,"n_cols":216,"rows_kept":14,"cut":false,"hidden":true,"merged":[]}
["都道府県No.","都道府県名","都道府県担当部局","都道府県担当者氏名","都道府県TEL","都道府県FAX","都道府県メール","応募No.","推薦\n順位","実施希望校","実施希望校ふりがな","全校児童生徒","所在地郵便番号前","実施校所在地郵便番号後","実施校所在地都道府県","実施校所在地住所","実施校学校長名","実施校担当者名","実施校TEL","実施校FAX","実施校メール","実施会場","合同開催","実施分野大項目","実施分野中項目","実施分野補足","実施\n回数","講師氏名","講師氏名ふりがな","所属団体","学校との関係","学校との関係その他","協力者名簿","連続実施年数同一講師","連続実施年数同一分野","連続実施確認１","連続実施理由項目","連続実施理由詳細","実施日第1回","実施時間1回目","実施合計1回目","連続する実施1回目","連続都道府県1回目","連続学校名1回目","教科の位置付け1回目","教科の位置付け詳細1回目","著作権1回目","著作権許諾取得有無1回目","参加児童生徒数1回目","参加児童生徒単位1回目","参加児童生徒単位詳細1回目","補助者①氏名1回目","補助者①演奏時間1回目","補助者①実技時間1回目","補助者①単労時間1回目","補助者①謝金合計1回目","補助者②氏名1回目","補助者②演奏時間1回目","補助者②実技時間1回目","補助者②単労時間1回目","補助者②謝金合計1回目","補助者③氏名1回目","補助者③演奏時間1回目","補助者③実技時間1回目","補助者③単労時間1回目","補助者③謝金合計1回目","補助者④氏名1回目","補助者④演奏時間1回目","補助者④実技時間1回目","補助者④単労時間1回目","補助者④謝金合計1回目","補助者⑤氏名1回目","補助者⑤演奏時間1回目","補助者⑤実技時間1回目","補助者⑤単労時間1回目","補助者⑤謝金合計1回目","補助者⑥氏名1回目","補助者⑥演奏時間1回目","補助者⑥実技時間1回目","補助者⑥単労時間1回目","補助者⑥謝金合計1回目","補助者⑦氏名1回目","補助者⑦演奏時間1回目","補助者⑦実技時間1回目","補助者⑦単労時間1回目","補助者⑦謝金合計1回目","補助者⑧氏名1回目","補助者⑧演奏時間1回目","補助者⑧実技時間1回目","補助者⑧単労時間1回目","補助者⑧謝金合計1回目","1回目補助者人数","1回目謝金合計","事業内容1回目","実施日第2回","実施時間2回目","実施合計2回目","連続する実施2回目","連続都道府県2回目","連続学校名2回目","教科の位置付け2回目","教科の位置付け詳細2回目","著作権2回目","著作権許諾取得有無2回目","参加児童生徒数2回目","参加児童生徒単位2回目","参加児童生徒単位詳細2回目","補助者①氏名2回目","補助者①演奏時間2回目","補助者①実技時間2回目","補助者①単労時間2回目","補助者①謝金合計2回目","補助者②氏名2回目","補助者②演奏時間2回目","補助者②実技時間2回目","補助者②単労時間2回目","補助者②謝金合計2回目","補助者③氏名2回目","補助者③演奏時間2回目","補助者③実技時間2回目","補助者③単労時間2回目","補助者③謝金合計2回目","補助者④氏名2回目","補助者④演奏時間2回目","補助者④実技時間2回目","補助者④単労時間2回目","補助者④謝金合計2回目","補助者⑤氏名2回目","補助者⑤演奏時間2回目","補助者⑤実技時間2回目","補助者⑤単労時間2回目","補助者⑤謝金合計2回目","補助者⑥氏名2回目","補助者⑥演奏時間2回目","補助者⑥実技時間2回目","補助者⑥単労時間2回目","補助者⑥謝金合計2回目","補助者⑦氏名2回目","補助者⑦演奏時間2回目","補助者⑦実技時間2回目","補助者⑦単労時間2回目","補助者⑦謝金合計2回目","補助者⑧氏名2回目","補助者⑧演奏時間2回目","補助者⑧実技時間2回目","補助者⑧単労時間2回目","補助者⑧謝金合計2回目","2回目補助者人数","2回目謝金合計","事業内容2回目","実施日第3回","実施時間3回目","実施合計3回目","連続する実施3回目","連続都道府県3回目","連続学校名3回目","教科の位置付け3回目","教科の位置付け詳細3回目","著作権3回目","著作権許諾取得有無3回目","参加児童生徒数3回目","参加児童生徒単位3回目","参加児童生徒単位詳細3回目","補助者①氏名3回目","補助者①演奏時間3回目","補助者①実技時間3回目","補助者①単労時間3回目","補助者①謝金合計3回目","補助者②氏名3回目","補助者②演奏時間3回目","補助者②実技時間3回目","補助者②単労時間3回目","補助者②謝金合計3回目","補助者③氏名3回目","補助者③演奏時間3回目","補助者③実技時間3回目","補助者③単労時間3回目","補助者③謝金合計3回目","補助者④氏名3回目","補助者④演奏時間3回目","補助者④実技時間3回目","補助者④単労時間3回目","補助者④謝金合計3回目","補助者⑤氏名3回目","補助者⑤演奏時間3回目","補助者⑤実技時間3回目","補助者⑤単労時間3回目","補助者⑤謝金合計3回目","補助者⑥氏名3回目","補助者⑥演奏時間3回目","補助者⑥実技時間3回目","補助者⑥単労時間3回目","補助者⑥謝金合計3回目","補助者⑦氏名3回目","補助者⑦演奏時間3回目","補助者⑦実技時間3回目","補助者⑦単労時間3回目","補助者⑦謝金合計3回目","補助者⑧氏名3回目","補助者⑧演奏時間3回目","補助者⑧実技時間3回目","補助者⑧単労時間3回目","補助者⑧謝金合計3回目","3回目補助者人数","3回目謝金合計","事業内容3回目","謝金","旅費","講演等\n諸雑費","合計","過疎","山村","離島","半島","奄美／\n小笠原","備考"]
[null,"【様式１】!P4","【様式１】!P5","【様式１】!P6","【様式１】!X4","【様式１】!X5","【様式１】!X6","【様式２・３】実施希望調書!U1","【様式１】実施希望調書!B10","【様式２・３】実施希望調書!E7","【様式２・３】実施希望調書!E6","【様式２・３】実施希望調書!W6","【様式２・３】実施希望調書!F8","【様式２・３】実施希望調書!J8","【様式２・３】実施希望調書!P8","【様式２・３】実施希望調書!E9","【様式２・３】実施希望調書!W8","【様式２・３】実施希望調書!W9","【様式２・３】実施希望調書!E10","【様式２・３】実施希望調書!N10","【様式２・３】実施希望調書!W10","【様式２・３】実施希望調書!E10","【様式２・３】実施希望調書!H11","【様式２・３】実施希望調書!E13","【様式２・３】実施希望調書!I13","【様式２・３】実施希望調書!M13","【様式２・３】実施希望調書!F14","【様式２・３】実施希望調書!E16","【様式２・３】実施希望調書!E15","【様式２・３】実施希望調書!W15","【様式２・３】実施希望調書!E17","【様式２・３】実施希望調書!S17","【様式２・３】実施希望調書!E18","【様式２・３】実施希望調書!U18","【様式２・３】実施希望調書!AA18","【様式２・３】実施希望調書!AB20","【様式２・３】実施希望調書!E22","【様式２・３】実施希望調書!E24","【様式２・３】実施希望調書!E25","【様式２・３】実施希望調書!S25","【様式２・３】実施希望調書!AA25","【様式２・３】実施希望調書!E26","【様式２・３】実施希望調書!O26","【様式２・３】実施希望調書!V26","【様式２・３】実施希望調書!E27","【様式２・３】実施希望調書!S27","【様式２・３】実施希望調書!E28","【様式２・３】実施希望調書!V28","【様式２・３】実施希望調書!G29","【様式２・３】実施希望調書!P29","【様式２・３】実施希望調書!S30","【様式２・３】実施希望調書!F32","【様式２・３】実施希望調書!N32","【様式２・３】実施希望調書!S32","【様式２・３】実施希望調書!X32","【様式２・３】実施希望調書!AA32","【様式２・３】実施希望調書!F33","【様式２・３】実施希望調書!N33","【様式２・３】実施希望調書!S33","【様式２・３】実施希望調書!X33","【様式２・３】実施希望調書!AA33","【様式２・３】実施希望調書!F34","【様式２・３】実施希望調書!N34","【様式２・３】実施希望調書!S34","【様式２・３】実施希望調書!X34","【様式２・３】実施希望調書!AA34","【様式２・３】実施希望調書!F35","【様式２・３】実施希望調書!N35","【様式２・３】実施希望調書!S35","【様式２・３】実施希望調書!X35","【様式２・３】実施希望調書!AA35","【様式２・３】実施希望調書!F36","【様式２・３】実施希望調書!N36","【様式２・３】実施希望調書!S36","【様式２・３】実施希望調書!X36","【様式２・３】実施希望調書!AA36","【様式２・３】実施希望調書!F37","【様式２・３】実施希望調書!N37","【様式２・３】実施希望調書!S37","【様式２・３】実施希望調書!X37","【様式２・３】実施希望調書!AA37","【様式２・３】実施希望調書!F38","【様式２・３】実施希望調書!N38","【様式２・３】実施希望調書!S38","【様式２・３】実施希望調書!X38","【様式２・３】実施希望調書!AA38","【様式２・３】実施希望調書!F39","【様式２・３】実施希望調書!N39","【様式２・３】実施希望調書!S39","【様式２・３】実施希望調書!X39","【様式２・３】実施希望調書!AA39","【様式２・３】実施希望調書!F40","【様式２・３】実施希望調書!AA40","【様式２・３】実施希望調書!B42","【様式２・３】実施希望調書!E43","【様式２・３】実施希望調書!S43","【様式２・３】実施希望調書!AA43","【様式２・３】実施希望調書!E44","【様式２・３】実施希望調書!O44","【様式２・３】実施希望調書!V44","【様式２・３】実施希望調書!E45","【様式２・３】実施希望調書!S45","【様式２・３】実施希望調書!E46","【様式２・３】実施希望調書!V46","【様式２・３】実施希望調書!G47","【様式２・３】実施希望調書!P47","【様式２・３】実施希望調書!S48","【様式２・３】実施希望調書!F50","【様式２・３】実施希望調書!N50","【様式２・３】実施希望調書!S50","【様式２・３】実施希望調書!X50","【様式２・３】実施希望調書!AA50","【様式２・３】実施希望調書!F51","【様式２・３】実施希望調書!N51","【様式２・３】実施希望調書!S51","【様式２・３】実施希望調書!X51","【様式２・３】実施希望調書!AA51","【様式２・３】実施希望調書!F52","【様式２・３】実施希望調書!N52","【様式２・３】実施希望調書!S52","【様式２・３】実施希望調書!X52","【様式２・３】実施希望調書!AA52","【様式２・３】実施希望調書!F53","【様式２・３】実施希望調書!N53","【様式２・３】実施希望調書!S53","【様式２・３】実施希望調書!X53","【様式２・３】実施希望調書!AA53","【様式２・３】実施希望調書!F54","【様式２・３】実施希望調書!N54","【様式２・３】実施希望調書!S54","【様式２・３】実施希望調書!X54","【様式２・３】実施希望調書!AA54","【様式２・３】実施希望調書!F55","【様式２・３】実施希望調書!N55","【様式２・３】実施希望調書!S55","【様式２・３】実施希望調書!X55","【様式２・３】実施希望調書!AA55","【様式２・３】実施希望調書!F56","【様式２・３】実施希望調書!N56","【様式２・３】実施希望調書!S56","【様式２・３】実施希望調書!X56","【様式２・３】実施希望調書!AA56","【様式２・３】実施希望調書!F57","【様式２・３】実施希望調書!N57","【様式２・３】実施希望調書!S57","【様式２・３】実施希望調書!X57","【様式２・３】実施希望調書!AA57","【様式２・３】実施希望調書!F58","【様式２・３】実施希望調書!AA58","【様式２・３】実施希望調書!B60","【様式２・３】実施希望調書!E61","【様式２・３】実施希望調書!S61","【様式２・３】実施希望調書!AA61","【様式２・３】実施希望調書!E62","【様式２・３】実施希望調書!O62","【様式２・３】実施希望調書!V62","【様式２・３】実施希望調書!E63","【様式２・３】実施希望調書!S63","【様式２・３】実施希望調書!E64","【様式２・３】実施希望調書!V64","【様式２・３】実施希望調書!G65","【様式２・３】実施希望調書!P65","【様式２・３】実施希望調書!S66","【様式２・３】実施希望調書!F68","【様式２・３】実施希望調書!N68","【様式２・３】実施希望調書!S68","【様式２・３】実施希望調書!X68","【様式２・３】実施希望調書!AA68","【様式２・３】実施希望調書!F69","【様式２・３】実施希望調書!N69","【様式２・３】実施希望調書!S69","【様式２・３】実施希望調書!X69","【様式２・３】実施希望調書!AA69","【様式２・３】実施希望調書!F70","【様式２・３】実施希望調書!N70","【様式２・３】実施希望調書!S70","【様式２・３】実施希望調書!X70","【様式２・３】実施希望調書!AA70","【様式２・３】実施希望調書!F71","【様式２・３】実施希望調書!N71","【様式２・３】実施希望調書!S71","【様式２・３】実施希望調書!X71","【様式２・３】実施希望調書!AA71","【様式２・３】実施希望調書!F72","【様式２・３】実施希望調書!N72","【様式２・３】実施希望調書!S72","【様式２・３】実施希望調書!X72","【様式２・３】実施希望調書!AA72","【様式２・３】実施希望調書!F73","【様式２・３】実施希望調書!N73","【様式２・３】実施希望調書!S73","【様式２・３】実施希望調書!X73","【様式２・３】実施希望調書!AA73","【様式２・３】実施希望調書!F74","【様式２・３】実施希望調書!N74","【様式２・３】実施希望調書!S74","【様式２・３】実施希望調書!X74","【様式２・３】実施希望調書!AA74","【様式２・３】実施希望調書!F75","【様式２・３】実施希望調書!N75","【様式２・３】実施希望調書!S75","【様式２・３】実施希望調書!X75","【様式２・３】実施希望調書!AA75","【様式２・３】実施希望調書!F76","【様式２・３】実施希望調書!AA76","【様式２・３】実施希望調書!B78","【様式２・３】実施希望調書!M102","【様式２・３】実施希望調書!S102","【様式２・３】実施希望調書!Y115","【様式２・３】実施希望調書!S120","【様式１】実施希望調書!S10","【様式１】実施希望調書!T10","【様式１】実施希望調書!U10","【様式１】実施希望調書!V10","【様式１】実施希望調書!W10","【様式１】実施希望調書!X8"]
[null,null,null,null,null,null,null,{"$f":"IF(LEN(【様式２・３】実施希望調書!U1)=0,\"\",【様式２・３】実施希望調書!U1)","v":""},null,{"$f":"IF(LEN(【様式２・３】実施希望調書!E7)=0,\"\",【様式２・３】実施希望調書!E7)","v":"○○市立文化小学校"},{"$f":"IF(LEN(【様式２・３】実施希望調書!E6)=0,\"\",【様式２・３】実施希望調書!E6)","v":"○○しりつ　ぶんか　しょうがっこう"},{"$f":"IF(LEN(【様式２・３】実施希望調書!W6)=0,\"\",【様式２・３】実施希望調書!W6)","v":300},{"$f":"IF(LEN(【様式２・３】実施希望調書!F8)=0,\"\",【様式２・３】実施希望調書!F8)","v":"***"},{"$f":"IF(LEN(【様式２・３】実施希望調書!J8)=0,\"\",【様式２・３】実施希望調書!J8)","v":"****"},{"$f":"IF(LEN(【様式２・３】実施希望調書!P8)=0,\"\",【様式２・３】実施希望調書!P8)","v":"北海道"},{"$f":"IF(LEN(【様式２・３】実施希望調書!E9)=0,\"\",【様式２・３】実施希望調書!E9)","v":"○○市　△△　1-1-1"},{"$f":"IF(LEN(【様式２・３】実施希望調書!W8)=0,\"\",【様式２・３】実施希望調書!W8)","v":"◇◇　◇◇"},{"$f":"IF(LEN(【様式２・３】実施希望調書!W9)=0,\"\",【様式２・３】実施希望調書!W9)","v":"□□　□□"},{"$f":"IF(LEN(【様式２・３】実施希望調書!E10)=0,\"\",【様式２・３】実施希望調書!E10)","v":"00-0000-0000"},{"$f":"IF(LEN(【様式２・３】実施希望調書!N10)=0,\"\",【様式２・３】実施希望調書!N10)","v":"00-0000-1111"},{"$f":"IF(LEN(【様式２・３】実施希望調書!W10)=0,\"\",【様式２・３】実施希望調書!W10)","v":"xxx@xxxx.xx.xx"},{"$f":"IF(LEN(【様式２・３】実施希望調書!E11)=0,\"\",【様式２・３】実施希望調書!E11)","v":"実施校の教室・体育館"},{"$f":"IF(LEN(【様式２・３】実施希望調書!W11)=0,\"\",【様式２・３】実施希望調書!W11)","v":"なし"},{"$f":"IF(LEN(【様式２・３】実施希望調書!E13)=0,\"\",【様式２・３】実施希望調書!E13)","v":"音楽"},{"$f":"IF(LEN(【様式２・３】実施希望調書!I13)=0,\"\",【様式２・３】実施希望調書!I13)","v":"C　弦楽器"},{"$f":"IF(LEN(【様式２・３】実施希望調書!M13)=0,\"\",【様式２・３】実施希望調書!M13)","v":""},{"$f":"IF(LEN(【様式２・３】実施希望調書!F14)=0,\"\",【様式２・３】実施希望調書!F14)","v":3},{"$f":"IF(LEN(【様式２・３】実施希望調書!E16)=0,\"\",【様式２・３】実施希望調書!E16)","v":"芸術　花子"},{"$f":"IF(LEN(【様式２・３】実施希望調書!E15)=0,\"\",【様式２・３】実施希望調書!E15)","v":"げいじゅつ　はなこ"},{"$f":"IF(LEN(【様式２・３】実施希望調書!W15)=0,\"\",【様式２・３】実施希望調書!W15)","v":"●●室内管弦楽団"},{"$f":"IF(LEN(【様式２・３】実施希望調書!E17)=0,\"\",【様式２・３】実施希望調書!E17)","v":"卒業生"},{"$f":"IF(LEN(【様式２・３】実施希望調書!S17)=0,\"\",【様式２・３】実施希望調書!S17)","v":""},{"$f":"IF(LEN(【様式２・３】実施希望調書!E18)=0,\"\",【様式２・３】実施希望調書!E18)","v":"登録済み"},{"$f":"IF(LEN(【様式２・３】実施希望調書!U18)=0,\"\",【様式２・３】実施希望調書!U18)","v":2},{"$f":"IF(LEN(【様式２・３】実施希望調書!AA18)=0,\"\",【様式２・３】実施希望調書!AA18)","v":4},{"$f":"IF(LEN(【様式２・３】実施希望調書!AB20)=0,\"\",【様式２・３】実施希望調書!AB20)","v":"確認済み"},{"$f":"IF(LEN(【様式２・３】実施希望調書!E22)=0,\"\",【様式２・３】実施希望調書!E22)","v":"希望する講師が芸術分野以外にも申請校が求める専門スキルを所有しており他の講師での実施が困難（福祉現場での活動経験が豊富等）"},{"$f":"IF(LEN(【様式２・３】実施希望調書!E24)=0,\"\",【様式２・３】実施希望調書!E24)","v":"本校では毎年、芸術文化の鑑賞や活動体験を通して、子供たちの豊かな情操を育み、芸術に親しむ感性を養うことを目的として芸術家の派遣事業を活用している。本校の児童の特性として、発達に困難を抱えた児童が多く、毎年異なる講師を迎えることは、子供たちへ不安や緊張といったストレスをかける要因となり、本来の目的達成に支障が生じてしまう。本校が希望する○○先生は本校の児童の特性に深く理解があり、教員側・保護者側からも安心して実施をお任せできることから、令和4年度も継続して○○先生を講師に迎えることを希望する。"},{"$f":"IF(LEN(【様式２・３】実施希望調書!E25)=0,\"\",【様式２・３】実施希望調書!E25)","v":"2022-06-10"},{"$f":"IF(LEN(【様式２・３】実施希望調書!S25)=0,\"\",【様式２・３】実施希望調書!S25)","v":"午前"},{"$f":"IF(LEN(【様式２・３】実施希望調書!AA25)=0,\"\",【様式２・３】実施希望調書!AA25)","v":90},{"$f":"IF(LEN(【様式２・３】実施希望調書!E26)=0,\"\",【様式２・３】実施希望調書!E26)","v":"有"},{"$f":"IF(LEN(【様式２・３】実施希望調書!O26)=0,\"\",【様式２・３】実施希望調書!O26)","v":"北海道"},{"$f":"IF(LEN(【様式２・３】実施希望調書!V26)=0,\"\",【様式２・３】実施希望調書!V26)","v":"◎◎市立芸術中学校"},{"$f":"IF(LEN(【様式２・３】実施希望調書!E27)=0,\"\",【様式２・３】実施希望調書!E27)","v":"教科"},{"$f":"IF(LEN(【様式２・３】実施希望調書!S27)=0,\"\",【様式２・３】実施希望調書!S27)","v":"音楽"},{"$f":"IF(LEN(【様式２・３】実施希望調書!E28)=0,\"\",【様式２・３】実施希望調書!E28)","v":"許諾が必要"},{"$f":"IF(LEN(【様式２・３】実施希望調書!V28)=0,\"\",【様式２・３】実施希望調書!V28)","v":"許諾取得済み"},{"$f":"IF(LEN(【様式２・３】実施希望調書!G29)=0,\"\",【様式２・３】実施希望調書!G29)","v":100},{"$f":"IF(LEN(【様式２・３】実施希望調書!P29)=0,\"\",【様式２・３】実施希望調書!P29)","v":"学年単位"},{"$f":"IF(LEN(【様式２・３】実施希望調書!S30)=0,\"\",【様式２・３】実施希望調書!S30)","v":"5，6年生"},{"$f":"IF(LEN(【様式２・３】実施希望調書!F32)=0,\"\",【様式２・３】実施希望調書!F32)","v":"次代　太郎"},{"$f":"IF(LEN(【様式２・３】実施希望調書!N32)=0,\"\",【様式２・３】実施希望調書!N32)","v":1},{"$f":"IF(LEN(【様式２・３】実施希望調書!S32)=0,\"\",【様式２・３】実施希望調書!S32)","v":1},{"$f":"IF(LEN(【様式２・３】実施希望調書!X32)=0,\"\",【様式２・３】実施希望調書!X32)","v":""},{"$f":"IF(LEN(【様式２・３】実施希望調書!AA32)=0,\"\",【様式２・３】実施希望調書!AA32)","v":11720},{"$f":"IF(LEN(【様式２・３】実施希望調書!F33)=0,\"\",【様式２・３】実施希望調書!F33)","v":"音楽　花子"},{"$f":"IF(LEN(【様式２・３】実施希望調書!N33)=0,\"\",【様式２・３】実施希望調書!N33)","v":1},{"$f":"IF(LEN(【様式２・３】実施希望調書!S33)=0,\"\",【様式２・３】実施希望調書!S33)","v":1},{"$f":"IF(LEN(【様式２・３】実施希望調書!X33)=0,\"\",【様式２・３】実施希望調書!X33)","v":""},{"$f":"IF(LEN(【様式２・３】実施希望調書!AA33)=0,\"\",【様式２・３】実施希望調書!AA33)","v":11720},{"$f":"IF(LEN(【様式２・３】実施希望調書!F34)=0,\"\",【様式２・３】実施希望調書!F34)","v":"演奏　太郎"},{"$f":"IF(LEN(【様式２・３】実施希望調書!N34)=0,\"\",【様式２・３】実施希望調書!N34)","v":1},{"$f":"IF(LEN(【様式２・３】実施希望調書!S34)=0,\"\",【様式２・３】実施希望調書!S34)","v":1},{"$f":"IF(LEN(【様式２・３】実施希望調書!X34)=0,\"\",【様式２・３】実施希望調書!X34)","v":""},{"$f":"IF(LEN(【様式２・３】実施希望調書!AA34)=0,\"\",【様式２・３】実施希望調書!AA34)","v":11720},{"$f":"IF(LEN(【様式２・３】実施希望調書!F35)=0,\"\",【様式２・３】実施希望調書!F35)","v":""},{"$f":"IF(LEN(【様式２・３】実施希望調書!N35)=0,\"\",【様式２・３】実施希望調書!N35)","v":""},{"$f":"IF(LEN(【様式２・３】実施希望調書!S35)=0,\"\",【様式２・３】実施希望調書!S35)","v":""},{"$f":"IF(LEN(【様式２・３】実施希望調書!X35)=0,\"\",【様式２・３】実施希望調書!X35)","v":""},{"$f":"IF(LEN(【様式２・３】実施希望調書!AA35)=0,\"\",【様式２・３】実施希望調書!AA35)","v":0},{"$f":"IF(LEN(【様式２・３】実施希望調書!F36)=0,\"\",【様式２・３】実施希望調書!F36)","v":""},{"$f":"IF(LEN(【様式２・３】実施希望調書!N36)=0,\"\",【様式２・３】実施希望調書!N36)","v":""},{"$f":"IF(LEN(【様式２・３】実施希望調書!S36)=0,\"\",【様式２・３】実施希望調書!S36)","v":""},{"$f":"IF(LEN(【様式２・３】実施希望調書!X36)=0,\"\",【様式２・３】実施希望調書!X36)","v":""},{"$f":"IF(LEN(【様式２・３】実施希望調書!AA36)=0,\"\",【様式２・３】実施希望調書!AA36)","v":0},{"$f":"IF(LEN(【様式２・３】実施希望調書!F37)=0,\"\",【様式２・３】実施希望調書!F37)","v":""},{"$f":"IF(LEN(【様式２・３】実施希望調書!N37)=0,\"\",【様式２・３】実施希望調書!N37)","v":""},{"$f":"IF(LEN(【様式２・３】実施希望調書!S37)=0,\"\",【様式２・３】実施希望調書!S37)","v":""},{"$f":"IF(LEN(【様式２・３】実施希望調書!X37)=0,\"\",【様式２・３】実施希望調書!X37)","v":""},{"$f":"IF(LEN(【様式２・３】実施希望調書!AA37)=0,\"\",【様式２・３】実施希望調書!AA37)","v":0},{"$f":"IF(LEN(【様式２・３】実施希望調書!F38)=0,\"\",【様式２・３】実施希望調書!F38)","v":""},{"$f":"IF(LEN(【様式２・３】実施希望調書!N38)=0,\"\",【様式２・３】実施希望調書!N38)","v":""},{"$f":"IF(LEN(【様式２・３】実施希望調書!S38)=0,\"\",【様式２・３】実施希望調書!S38)","v":""},{"$f":"IF(LEN(【様式２・３】実施希望調書!X38)=0,\"\",【様式２・３】実施希望調書!X38)","v":""},{"$f":"IF(LEN(【様式２・３】実施希望調書!AA38)=0,\"\",【様式２・３】実施希望調書!AA38)","v":0},{"$f":"IF(LEN(【様式２・３】実施希望調書!F39)=0,\"\",【様式２・３】実施希望調書!F39)","v":""},{"$f":"IF(LEN(【様式２・３】実施希望調書!N39)=0,\"\",【様式２・３】実施希望調書!N39)","v":""},{"$f":"IF(LEN(【様式２・３】実施希望調書!S39)=0,\"\",【様式２・３】実施希望調書!S39)","v":""},{"$f":"IF(LEN(【様式２・３】実施希望調書!X39)=0,\"\",【様式２・３】実施希望調書!X39)","v":""},{"$f":"IF(LEN(【様式２・３】実施希望調書!AA39)=0,\"\",【様式２・３】実施希望調書!AA39)","v":0},{"$f":"IF(LEN(【様式２・３】実施希望調書!F40)=0,\"\",【様式２・３】実施希望調書!F40)","v":3},{"$f":"IF(LEN(【様式２・３】実施希望調書!AA40)=0,\"\",【様式２・３】実施希望調書!AA40)","v":35160},{"$f":"IF(LEN(【様式２・３】実施希望調書!B42)=0,\"\",【様式２・３】実施希望調書!B42)","v":"○○○○○○○○○○○○○○○○○○○○○○○○○○○○○○○○○○○○○○○○○○○○○○○○○○○○○○○○○○○○○○○○○○○○○○○○○○○○○○○○○○○○○○○○○○○○○○○○○○○○○○○○○○○○○○○○○○○○○○○○○○○○○○○○○○○○○○○○○○○○○○○○○○○○○○○○○○○○○○○○○○○○○○○○○○○○"},{"$f":"IF(LEN(【様式２・３】実施希望調書!E43)=0,\"\",【様式２・３】実施希望調書!E43)","v":"2022-06-17"},{"$f":"IF(LEN(【様式２・３】実施希望調書!S43)=0,\"\",【様式２・３】実施希望調書!S43)","v":"午後"},{"$f":"IF(LEN(【様式２・３】実施希望調書!AA43)=0,\"\",【様式２・３】実施希望調書!AA43)","v":150},{"$f":"IF(LEN(【様式２・３】実施希望調書!E44)=0,\"\",【様式２・３】実施希望調書!E44)","v":"無"},{"$f":"IF(LEN(【様式２・３】実施希望調書!O44)=0,\"\",【様式２・３】実施希望調書!O44)","v":""},{"$f":"IF(LEN(【様式２・３】実施希望調書!V44)=0,\"\",【様式２・３】実施希望調書!V44)","v":""},{"$f":"IF(LEN(【様式２・３】実施希望調書!E45)=0,\"\",【様式２・３】実施希望調書!E45)","v":"総合的な学習の時間"},{"$f":"IF(LEN(【様式２・３】実施希望調書!S45)=0,\"\",【様式２・３】実施希望調書!S45)","v":""},{"$f":"IF(LEN(【様式２・３】実施希望調書!E46)=0,\"\",【様式２・３】実施希望調書!E46)","v":"許諾は不要"},{"$f":"IF(LEN(【様式２・３】実施希望調書!V46)=0,\"\",【様式２・３】実施希望調書!V46)","v":""},{"$f":"IF(LEN(【様式２・３】実施希望調書!G47)=0,\"\",【様式２・３】実施希望調書!G47)","v":100},{"$f":"IF(LEN(【様式２・３】実施希望調書!P47)=0,\"\",【様式２・３】実施希望調書!P47)","v":"学年単位"},{"$f":"IF(LEN(【様式２・３】実施希望調書!S48)=0,\"\",【様式２・３】実施希望調書!S48)","v":"5，6年生"},{"$f":"IF(LEN(【様式２・３】実施希望調書!F50)=0,\"\",【様式２・３】実施希望調書!F50)","v":"次代　太郎"},{"$f":"IF(LEN(【様式２・３】実施希望調書!N50)=0,\"\",【様式２・３】実施希望調書!N50)","v":2},{"$f":"IF(LEN(【様式２・３】実施希望調書!S50)=0,\"\",【様式２・３】実施希望調書!S50)","v":1},{"$f":"IF(LEN(【様式２・３】実施希望調書!X50)=0,\"\",【様式２・３】実施希望調書!X50)","v":""},{"$f":"IF(LEN(【様式２・３】実施希望調書!AA50)=0,\"\",【様式２・３】実施希望調書!AA50)","v":18240},{"$f":"IF(LEN(【様式２・３】実施希望調書!F51)=0,\"\",【様式２・３】実施希望調書!F51)","v":"音楽　花子"},{"$f":"IF(LEN(【様式２・３】実施希望調書!N51)=0,\"\",【様式２・３】実施希望調書!N51)","v":2},{"$f":"IF(LEN(【様式２・３】実施希望調書!S51)=0,\"\",【様式２・３】実施希望調書!S51)","v":1},{"$f":"IF(LEN(【様式２・３】実施希望調書!X51)=0,\"\",【様式２・３】実施希望調書!X51)","v":""},{"$f":"IF(LEN(【様式２・３】実施希望調書!AA51)=0,\"\",【様式２・３】実施希望調書!AA51)","v":18240},{"$f":"IF(LEN(【様式２・３】実施希望調書!F52)=0,\"\",【様式２・３】実施希望調書!F52)","v":"演奏　太郎"},{"$f":"IF(LEN(【様式２・３】実施希望調書!N52)=0,\"\",【様式２・３】実施希望調書!N52)","v":2},{"$f":"IF(LEN(【様式２・３】実施希望調書!S52)=0,\"\",【様式２・３】実施希望調書!S52)","v":1},{"$f":"IF(LEN(【様式２・３】実施希望調書!X52)=0,\"\",【様式２・３】実施希望調書!X52)","v":""},{"$f":"IF(LEN(【様式２・３】実施希望調書!AA52)=0,\"\",【様式２・３】実施希望調書!AA52)","v":18240},{"$f":"IF(LEN(【様式２・３】実施希望調書!F53)=0,\"\",【様式２・３】実施希望調書!F53)","v":""},{"$f":"IF(LEN(【様式２・３】実施希望調書!N53)=0,\"\",【様式２・３】実施希望調書!N53)","v":""},{"$f":"IF(LEN(【様式２・３】実施希望調書!S53)=0,\"\",【様式２・３】実施希望調書!S53)","v":""},{"$f":"IF(LEN(【様式２・３】実施希望調書!X53)=0,\"\",【様式２・３】実施希望調書!X53)","v":""},{"$f":"IF(LEN(【様式２・３】実施希望調書!AA53)=0,\"\",【様式２・３】実施希望調書!AA53)","v":0},{"$f":"IF(LEN(【様式２・３】実施希望調書!F54)=0,\"\",【様式２・３】実施希望調書!F54)","v":""},{"$f":"IF(LEN(【様式２・３】実施希望調書!N54)=0,\"\",【様式２・３】実施希望調書!N54)","v":""},{"$f":"IF(LEN(【様式２・３】実施希望調書!S54)=0,\"\",【様式２・３】実施希望調書!S54)","v":""},{"$f":"IF(LEN(【様式２・３】実施希望調書!X54)=0,\"\",【様式２・３】実施希望調書!X54)","v":""},{"$f":"IF(LEN(【様式２・３】実施希望調書!AA54)=0,\"\",【様式２・３】実施希望調書!AA54)","v":0},{"$f":"IF(LEN(【様式２・３】実施希望調書!F55)=0,\"\",【様式２・３】実施希望調書!F55)","v":""},{"$f":"IF(LEN(【様式２・３】実施希望調書!N55)=0,\"\",【様式２・３】実施希望調書!N55)","v":""},{"$f":"IF(LEN(【様式２・３】実施希望調書!S55)=0,\"\",【様式２・３】実施希望調書!S55)","v":""},{"$f":"IF(LEN(【様式２・３】実施希望調書!X55)=0,\"\",【様式２・３】実施希望調書!X55)","v":""},{"$f":"IF(LEN(【様式２・３】実施希望調書!AA55)=0,\"\",【様式２・３】実施希望調書!AA55)","v":0},{"$f":"IF(LEN(【様式２・３】実施希望調書!F56)=0,\"\",【様式２・３】実施希望調書!F56)","v":""},{"$f":"IF(LEN(【様式２・３】実施希望調書!N56)=0,\"\",【様式２・３】実施希望調書!N56)","v":""},{"$f":"IF(LEN(【様式２・３】実施希望調書!S56)=0,\"\",【様式２・３】実施希望調書!S56)","v":""},{"$f":"IF(LEN(【様式２・３】実施希望調書!X56)=0,\"\",【様式２・３】実施希望調書!X56)","v":""},{"$f":"IF(LEN(【様式２・３】実施希望調書!AA56)=0,\"\",【様式２・３】実施希望調書!AA56)","v":0},{"$f":"IF(LEN(【様式２・３】実施希望調書!F57)=0,\"\",【様式２・３】実施希望調書!F57)","v":""},{"$f":"IF(LEN(【様式２・３】実施希望調書!N57)=0,\"\",【様式２・３】実施希望調書!N57)","v":""},{"$f":"IF(LEN(【様式２・３】実施希望調書!S57)=0,\"\",【様式２・３】実施希望調書!S57)","v":""},{"$f":"IF(LEN(【様式２・３】実施希望調書!X57)=0,\"\",【様式２・３】実施希望調書!X57)","v":""},{"$f":"IF(LEN(【様式２・３】実施希望調書!AA57)=0,\"\",【様式２・３】実施希望調書!AA57)","v":0},{"$f":"IF(LEN(【様式２・３】実施希望調書!F58)=0,\"\",【様式２・３】実施希望調書!F58)","v":3},{"$f":"IF(LEN(【様式２・３】実施希望調書!AA58)=0,\"\",【様式２・３】実施希望調書!AA58)","v":54720},{"$f":"IF(LEN(【様式２・３】実施希望調書!B60)=0,\"\",【様式２・３】実施希望調書!B60)","v":"○○○○○○○○○○○○○○○○○○○○○○○○○○○○○○○○○○○○○○○○○○○○○○○○○○○○○○○○○○○○○○○○○○○○○○○○○○○○○○○○○○○○○○○○○○○○○○○○○○○○○○○○○○○○○○○○○○○○○○○○○○○○○○○○○○○○○○○○○○○○○○○○○○○○○○○○○○○○○○○○○○○○○○○○○○○○"},{"$f":"IF(LEN(【様式２・３】実施希望調書!E61)=0,\"\",【様式２・３】実施希望調書!E61)","v":"2022-06-23"},{"$f":"IF(LEN(【様式２・３】実施希望調書!S61)=0,\"\",【様式２・３】実施希望調書!S61)","v":"午前と午後"},{"$f":"IF(LEN(【様式２・３】実施希望調書!AA61)=0,\"\",【様式２・３】実施希望調書!AA61)","v":150},{"$f":"IF(LEN(【様式２・３】実施希望調書!E62)=0,\"\",【様式２・３】実施希望調書!E62)","v":"無"},{"$f":"IF(LEN(【様式２・３】実施希望調書!O62)=0,\"\",【様式２・３】実施希望調書!O62)","v":""},{"$f":"IF(LEN(【様式２・３】実施希望調書!V62)=0,\"\",【様式２・３】実施希望調書!V62)","v":""},{"$f":"IF(LEN(【様式２・３】実施希望調書!E63)=0,\"\",【様式２・３】実施希望調書!E63)","v":"特別活動"},{"$f":"IF(LEN(【様式２・３】実施希望調書!S63)=0,\"\",【様式２・３】実施希望調書!S63)","v":"文化的行事"},{"$f":"IF(LEN(【様式２・３】実施希望調書!E64)=0,\"\",【様式２・３】実施希望調書!E64)","v":"許諾が必要"},{"$f":"IF(LEN(【様式２・３】実施希望調書!V64)=0,\"\",【様式２・３】実施希望調書!V64)","v":"許諾未取得"},{"$f":"IF(LEN(【様式２・３】実施希望調書!G65)=0,\"\",【様式２・３】実施希望調書!G65)","v":300},{"$f":"IF(LEN(【様式２・３】実施希望調書!P65)=0,\"\",【様式２・３】実施希望調書!P65)","v":"全校児童/生徒"},{"$f":"IF(LEN(【様式２・３】実施希望調書!S66)=0,\"\",【様式２・３】実施希望調書!S66)","v":""},{"$f":"IF(LEN(【様式２・３】実施希望調書!F68)=0,\"\",【様式２・３】実施希望調書!F68)","v":"次代　太郎"},{"$f":"IF(LEN(【様式２・３】実施希望調書!N68)=0,\"\",【様式２・３】実施希望調書!N68)","v":2},{"$f":"IF(LEN(【様式２・３】実施希望調書!S68)=0,\"\",【様式２・３】実施希望調書!S68)","v":1},{"$f":"IF(LEN(【様式２・３】実施希望調書!X68)=0,\"\",【様式２・３】実施希望調書!X68)","v":""},{"$f":"IF(LEN(【様式２・３】実施希望調書!AA68)=0,\"\",【様式２・３】実施希望調書!AA68)","v":18240},{"$f":"IF(LEN(【様式２・３】実施希望調書!F69)=0,\"\",【様式２・３】実施希望調書!F69)","v":"音楽　花子"},{"$f":"IF(LEN(【様式２・３】実施希望調書!N69)=0,\"\",【様式２・３】実施希望調書!N69)","v":2},{"$f":"IF(LEN(【様式２・３】実施希望調書!S69)=0,\"\",【様式２・３】実施希望調書!S69)","v":""},{"$f":"IF(LEN(【様式２・３】実施希望調書!X69)=0,\"\",【様式２・３】実施希望調書!X69)","v":""},{"$f":"IF(LEN(【様式２・３】実施希望調書!AA69)=0,\"\",【様式２・３】実施希望調書!AA69)","v":13040},{"$f":"IF(LEN(【様式２・３】実施希望調書!F70)=0,\"\",【様式２・３】実施希望調書!F70)","v":"演奏　太郎"},{"$f":"IF(LEN(【様式２・３】実施希望調書!N70)=0,\"\",【様式２・３】実施希望調書!N70)","v":2},{"$f":"IF(LEN(【様式２・３】実施希望調書!S70)=0,\"\",【様式２・３】実施希望調書!S70)","v":""},{"$f":"IF(LEN(【様式２・３】実施希望調書!X70)=0,\"\",【様式２・３】実施希望調書!X70)","v":""},{"$f":"IF(LEN(【様式２・３】実施希望調書!AA70)=0,\"\",【様式２・３】実施希望調書!AA70)","v":13040},{"$f":"IF(LEN(【様式２・３】実施希望調書!F71)=0,\"\",【様式２・３】実施希望調書!F71)","v":"弦楽　花子"},{"$f":"IF(LEN(【様式２・３】実施希望調書!N71)=0,\"\",【様式２・３】実施希望調書!N71)","v":2},{"$f":"IF(LEN(【様式２・３】実施希望調書!S71)=0,\"\",【様式２・３】実施希望調書!S71)","v":""},{"$f":"IF(LEN(【様式２・３】実施希望調書!X71)=0,\"\",【様式２・３】実施希望調書!X71)","v":""},{"$f":"IF(LEN(【様式２・３】実施希望調書!AA71)=0,\"\",【様式２・３】実施希望調書!AA71)","v":13040},{"$f":"IF(LEN(【様式２・３】実施希望調書!F72)=0,\"\",【様式２・３】実施希望調書!F72)","v":"鍵盤　太郎"},{"$f":"IF(LEN(【様式２・３】実施希望調書!N72)=0,\"\",【様式２・３】実施希望調書!N72)","v":2},{"$f":"IF(LEN(【様式２・３】実施希望調書!S72)=0,\"\",【様式２・３】実施希望調書!S72)","v":""},{"$f":"IF(LEN(【様式２・３】実施希望調書!X72)=0,\"\",【様式２・３】実施希望調書!X72)","v":""},{"$f":"IF(LEN(【様式２・３】実施希望調書!AA72)=0,\"\",【様式２・３】実施希望調書!AA72)","v":13040},{"$f":"IF(LEN(【様式２・３】実施希望調書!F73)=0,\"\",【様式２・３】実施希望調書!F73)","v":""},{"$f":"IF(LEN(【様式２・３】実施希望調書!N73)=0,\"\",【様式２・３】実施希望調書!N73)","v":""},{"$f":"IF(LEN(【様式２・３】実施希望調書!S73)=0,\"\",【様式２・３】実施希望調書!S73)","v":""},{"$f":"IF(LEN(【様式２・３】実施希望調書!X73)=0,\"\",【様式２・３】実施希望調書!X73)","v":""},{"$f":"IF(LEN(【様式２・３】実施希望調書!AA73)=0,\"\",【様式２・３】実施希望調書!AA73)","v":0},{"$f":"IF(LEN(【様式２・３】実施希望調書!F74)=0,\"\",【様式２・３】実施希望調書!F74)","v":""},{"$f":"IF(LEN(【様式２・３】実施希望調書!N74)=0,\"\",【様式２・３】実施希望調書!N74)","v":""},{"$f":"IF(LEN(【様式２・３】実施希望調書!S74)=0,\"\",【様式２・３】実施希望調書!S74)","v":""},{"$f":"IF(LEN(【様式２・３】実施希望調書!X74)=0,\"\",【様式２・３】実施希望調書!X74)","v":""},{"$f":"IF(LEN(【様式２・３】実施希望調書!AA74)=0,\"\",【様式２・３】実施希望調書!AA74)","v":0},{"$f":"IF(LEN(【様式２・３】実施希望調書!F75)=0,\"\",【様式２・３】実施希望調書!F75)","v":""},{"$f":"IF(LEN(【様式２・３】実施希望調書!N75)=0,\"\",【様式２・３】実施希望調書!N75)","v":""},{"$f":"IF(LEN(【様式２・３】実施希望調書!S75)=0,\"\",【様式２・３】実施希望調書!S75)","v":""},{"$f":"IF(LEN(【様式２・３】実施希望調書!X75)=0,\"\",【様式２・３】実施希望調書!X75)","v":""},{"$f":"IF(LEN(【様式２・３】実施希望調書!AA75)=0,\"\",【様式２・３】実施希望調書!AA75)","v":0},{"$f":"IF(LEN(【様式２・３】実施希望調書!F76)=0,\"\",【様式２・３】実施希望調書!F76)","v":5},{"$f":"IF(LEN(【様式２・３】実施希望調書!AA76)=0,\"\",【様式２・３】実施希望調書!AA76)","v":70400},{"$f":"IF(LEN(【様式２・３】実施希望調書!B78)=0,\"\",【様式２・３】実施希望調書!B78)","v":"○○○○○○○○○○○○○○○○○○○○○○○○○○○○○○○○○○○○○○○○○○○○○○○○○○○○○○○○○○○○○○○○○○○○○○○○○○○○○○○○○○○○○○○○○○○○○○○○○○○○○○○○○○○○○○○○○○○○○○○○○○○○○○○○○○○○○○○○○○○○○○○○○○○○○○○○○○○○○○○○○○○○○○○○○○○○"},{"$f":"IF(LEN(【様式２・３】実施希望調書!M107)=0,\"\",【様式２・３】実施希望調書!M107)","v":267230},{"$f":"IF(LEN(【様式２・３】実施希望調書!S107)=0,\"\",【様式２・３】実施希望調書!S107)","v":65590},{"$f":"IF(LEN(【様式２・３】実施希望調書!Y122)=0,\"\",【様式２・３】実施希望調書!Y122)","v":48700},{"$f":"IF(LEN(【様式２・３】実施希望調書!S127)=0,\"\",【様式２・３】実施希望調書!S127)","v":381520}]
[]
[]
[]
[]
[]
[]
[]
[]
[]
[]
[null,null,null,null,{"$f":"IF(LEN(\"\")=0,\"\",)","v":""}]

{"sheet":"【様式９・１０】実施報告書","index":2,"n_rows":150,"n_cols":34,"rows_kept":150,"cut":false,"hidden":false,"merged":[[34,1,34,3],[34,4,34,14],[34,15,34,17],[33,31,33,32],[51,31,51,32],[71,31,71,32],[90,25,90,29],[46,5,46,9],[46,11,46,24],[37,1,46,3],[64,5,64,9],[64,11,64,24],[84,5,84,9],[84,11,84,24],[75,1,84,3],[55,1,64,3],[38,19,38,20],[38,21,38,22],[40,16,40,17],[40,19,40,20],[41,16,41,17],[38,16,38,17],[38,24,38,25],[38,26,38,29],[1,0,1,29],[0,0,0,2],[31,0,31,6],[31,7,31,13],[31,14,31,18],[9,15,9,19],[9,26,9,29],[9,20,9,25],[9,5,9,14],[6,5,6,13],[8,5,8,7],[29,0,29,29],[28,0,28,29],[27,0,27,29],[8,0,8,4],[9,0,9,4],[10,0,10,29],[12,4,12,29],[13,4,13,29],[14,4,14,29],[15,4,15,29],[11,0,11,29],[19,0,19,29],[22,0,22,29],[26,0,26,29],[24,0,24,29],[16,4,16,29],[17,4,17,29],[18,4,18,29],[20,0,20,29],[21,0,21,29],[25,0,25,29],[2,0,2,29],[5,15,5,19],[6,15,6,19],[7,15,7,19],[8,15,8,19],[4,20,4,29],[8,8,8,14],[5,5,5,14],[5,20,5,29],[7,5,7,14],[6,0,6,4],[7,0,7,4],[7,20,7,29],[4,15,4,19],[5,0,5,4],[4,0,4,4],[4,5,4,14],[6,20,6,29],[30,0,30,2],[41,5,41,10],[41,11,41,12],[41,14,41,15],[41,21,41,22],[41,24,41,25],[41,26,41,29],[40,5,40,10],[40,11,40,12],[40,14,40,15],[40,21,40,22],[40,24,40,25],[40,26,40,29],[41,19,41,20],[35,1,36,3],[35,4,36,5],[39,16,39,17],[39,19,39,20],[39,21,39,22],[39,24,39,25],[39,26,39,29],[33,1,33,3],[33,4,33,14],[33,15,33,17],[44,19,44,20],[44,21,44,22],[38,5,38,10],[38,11,38,12],[38,14,38,15],[39,5,39,10],[39,11,39,12],[39,14,39,15],[31,19,31,29],[32,0,32,29],[37,4,37,10],[37,11,37,25],[37,26,37,29],[33,18,33,23],[33,24,33,25],[33,26,33,27],[33,28,33,29],[35,6,36,8],[35,9,36,10],[35,11,36,14],[35,15,35,29],[36,15,36,17],[36,18,36,29],[34,18,34,29],[33,0,50,0],[43,14,43,15],[43,16,43,17],[43,19,43,20],[43,21,43,22],[43,24,43,25],[43,26,43,29],[44,24,44,25],[51,0,68,0],[51,1,51,3],[51,4,51,14],[51,15,51,17],[51,18,51,23],[51,24,51,25],[51,26,51,27],[46,26,46,29],[47,1,47,29],[48,1,48,29],[51,28,51,29],[52,1,52,3],[52,4,52,14],[52,15,52,17],[52,18,52,29],[49,1,49,29],[50,1,50,29],[53,1,54,3],[53,4,54,5],[53,6,54,8],[53,9,54,10],[53,11,54,14],[54,15,54,17],[54,18,54,29],[44,26,44,29],[45,5,45,10],[45,11,45,12],[45,14,45,15],[45,16,45,17],[45,19,45,20],[42,5,42,10],[42,11,42,12],[42,14,42,15],[42,16,42,17],[42,19,42,20],[42,24,42,25],[42,26,42,29],[43,5,43,10],[43,11,43,12],[42,21,42,22],[45,21,45,22],[45,24,45,25],[45,26,45,29],[44,5,44,10],[44,11,44,12],[44,14,44,15],[44,16,44,17],[53,15,53,29],[55,11,55,25],[55,26,55,29],[56,5,56,10],[56,11,56,12],[56,14,56,15],[56,16,56,17],[56,19,56,20],[56,21,56,22],[56,24,56,25],[56,26,56,29],[55,4,55,10],[59,19,59,20],[59,21,59,22],[59,24,59,25],[59,26,59,29],[57,26,57,29],[58,5,58,10],[58,11,58,12],[58,14,58,15],[58,16,58,17],[58,19,58,20],[58,21,58,22],[58,24,58,25],[58,26,58,29],[57,11,57,12],[57,14,57,15],[57,16,57,17],[57,19,57,20],[57,21,57,22],[57,24,57,25],[57,5,57,10],[59,5,59,10],[59,11,59,12],[59,14,59,15],[59,16,59,17],[60,5,60,10],[60,11,60,12],[60,14,60,15],[60,16,60,17],[60,19,60,20],[60,21,60,22],[60,24,60,25],[60,26,60,29],[65,1,65,29],[61,5,61,10],[61,11,61,12],[61,14,61,15],[61,16,61,17],[61,19,61,20],[61,21,61,22],[61,24,61,25],[61,26,61,29],[64,26,64,29],[66,1,66,29],[67,1,67,29],[68,1,68,29],[62,24,62,25],[62,26,62,29],[63,5,63,10],[63,11,63,12],[63,14,63,15],[63,16,63,17],[63,19,63,20],[63,21,63,22],[63,24,63,25],[63,26,63,29],[62,5,62,10],[62,11,62,12],[62,14,62,15],[62,16,62,17],[62,19,62,20],[62,21,62,22],[71,26,71,27],[71,28,71,29],[72,1,72,3],[72,4,72,14],[72,15,72,17],[72,18,72,29],[71,0,88,0],[71,1,71,3],[71,4,71,14],[71,15,71,17],[71,18,71,23],[71,24,71,25],[73,1,74,3],[73,4,74,5],[73,9,74,10],[73,11,74,14],[73,6,74,8],[73,15,73,29],[74,15,74,17],[74,18,74,29],[75,4,75,10],[75,11,75,25],[75,26,75,29],[76,5,76,10],[76,11,76,12],[76,14,76,15],[76,16,76,17],[76,19,76,20],[76,21,76,22],[76,24,76,25],[76,26,76,29],[77,5,77,10],[77,11,77,12],[77,14,77,15],[77,16,77,17],[77,19,77,20],[77,21,77,22],[77,24,77,25],[77,26,77,29],[78,11,78,12],[78,14,78,15],[78,16,78,17],[78,19,78,20],[78,21,78,22],[78,24,78,25],[80,21,80,22],[78,26,78,29],[79,5,79,10],[79,11,79,12],[79,14,79,15],[79,16,79,17],[79,19,79,20],[79,21,79,22],[79,24,79,25],[79,26,79,29],[87,1,87,29],[88,1,88,29],[82,24,82,25],[82,26,82,29],[83,5,83,10],[83,11,83,12],[83,14,83,15],[83,16,83,17],[83,19,83,20],[83,21,83,22],[83,24,83,25],[83,26,83,29],[82,5,82,10],[82,11,82,12],[82,14,82,15],[82,16,82,17],[82,19,82,20],[82,21,82,22],[69,0,69,2],[70,0,70,6],[70,7,70,13],[70,14,70,18],[70,19,70,29],[84,26,84,29],[85,1,85,29],[86,1,86,29],[80,24,80,25],[80,26,80,29],[81,5,81,10],[81,11,81,12],[81,14,81,15],[81,16,81,17],[81,19,81,20],[81,21,81,22],[81,24,81,25],[81,26,81,29],[80,5,80,10],[80,11,80,12],[80,14,80,15],[80,16,80,17],[80,19,80,20],[78,5,78,10],[108,0,108,5],[107,0,107,5],[107,6,107,11],[105,0,105,5],[105,18,105,22],[105,6,105,11],[101,0,101,5],[101,6,101,10],[101,12,101,16],[106,0,106,5],[106,6,106,11],[106,18,106,22],[101,18,101,22],[104,0,104,5],[104,6,104,11],[104,18,104,23],[104,12,104,14],[104,15,104,17],[105,12,105,14],[105,15,105,17],[106,12,106,14],[106,15,106,17],[107,12,107,14],[107,15,107,17],[94,8,94,11],[94,12,94,15],[94,17,94,19],[94,20,94,29],[91,0,91,29],[92,0,92,29],[93,0,94,3],[93,4,93,7],[93,8,93,11],[93,12,93,15],[93,17,93,22],[93,23,93,29],[94,4,94,7],[96,0,96,5],[96,6,96,23],[97,0,97,5],[98,1,98,5],[99,1,99,5],[100,1,100,5],[98,6,98,10],[99,6,99,10],[100,6,100,10],[97,6,97,11],[97,12,97,17],[97,18,97,23],[98,13,98,16],[99,13,99,16],[100,13,100,16],[98,18,98,22],[99,18,99,22],[100,18,100,22],[128,3,128,8],[124,3,124,8],[123,3,123,8],[123,9,123,12],[123,13,123,16],[119,18,119,22],[113,0,113,5],[113,18,113,22],[113,6,113,11],[116,15,116,17],[116,18,116,22],[123,0,123,2],[124,0,124,2],[107,18,107,22],[108,6,108,11],[108,18,108,22],[109,6,109,11],[109,18,109,22],[108,15,108,17],[109,12,109,14],[127,3,127,8],[126,3,126,8],[125,3,125,8],[112,0,112,5],[112,18,112,22],[111,0,111,5],[111,18,111,22],[111,6,111,11],[110,0,110,5],[110,18,110,22],[110,6,110,11],[110,12,110,14],[109,0,109,5],[109,15,109,17],[110,15,110,17],[111,12,111,14],[111,15,111,17],[108,12,108,14],[132,13,132,15],[122,0,122,16],[123,17,123,18],[124,17,124,18],[125,17,125,18],[126,17,126,18],[127,17,127,18],[128,9,128,11],[129,9,129,11],[130,9,130,11],[131,9,131,11],[132,9,132,11],[130,13,130,15],[121,13,121,29],[114,0,114,5],[115,0,115,5],[115,15,115,17],[115,18,115,22],[115,24,115,27],[116,0,116,5],[116,6,116,11],[116,12,116,14],[129,17,129,18],[141,4,141,8],[129,19,129,29],[130,19,130,29],[131,19,131,29],[132,19,132,29],[138,17,138,29],[119,0,119,17],[123,19,123,29],[124,19,124,29],[125,19,125,29],[126,19,126,29],[127,19,127,29],[138,0,138,12],[138,13,138,15],[124,13,124,15],[125,13,125,15],[126,13,126,15],[127,13,127,15],[128,13,128,15],[129,13,129,15],[124,9,124,11],[125,9,125,11],[126,9,126,11],[127,9,127,11],[146,16,146,17],[145,24,145,28],[145,18,145,20],[145,21,145,23],[144,24,144,28],[144,18,144,20],[144,21,144,23],[141,24,141,29],[142,24,142,28],[143,24,143,28],[143,18,143,20],[143,21,143,23],[147,4,147,8],[149,0,149,23],[149,24,149,28],[122,17,122,22],[122,24,122,29],[141,0,141,3],[142,0,142,3],[143,0,143,3],[144,0,144,3],[145,0,145,3],[148,24,148,28],[148,0,148,3],[148,4,148,8],[148,9,148,12],[148,18,148,20],[147,24,147,28],[147,0,147,3],[147,9,147,12],[147,18,147,20],[147,21,147,23],[146,24,146,28],[146,0,146,3],[146,18,146,20],[146,21,146,23],[143,9,143,12],[144,9,144,12],[145,9,145,12],[146,9,146,12],[142,4,142,8],[143,4,143,8],[144,4,144,8],[145,4,145,8],[146,4,146,8],[90,0,90,2],[147,14,147,15],[147,16,147,17],[148,14,148,15],[148,16,148,17],[8,20,8,29],[148,21,148,23],[142,14,142,15],[142,16,142,17],[143,14,143,15],[143,16,143,17],[144,14,144,15],[144,16,144,17],[145,14,145,15],[145,16,145,17],[146,14,146,15],[141,14,141,15],[141,16,141,17],[141,18,141,20],[141,21,141,23],[142,18,142,20],[142,21,142,23],[141,9,141,13],[142,9,142,12],[103,6,103,29],[119,24,119,29],[105,24,105,27],[106,24,106,27],[107,24,107,27],[108,24,108,27],[109,24,109,27],[110,24,110,27],[111,24,111,27],[112,24,112,27],[113,24,113,27],[104,24,104,29],[113,12,113,14],[113,15,113,17],[112,6,112,11],[112,12,112,14],[112,15,112,17],[114,6,114,11],[114,12,114,14],[114,15,114,17],[114,18,114,22],[114,24,114,27],[115,6,115,11],[115,12,115,14],[116,24,116,27],[117,0,117,5],[117,6,117,11],[117,12,117,14],[117,15,117,17],[117,18,117,22],[117,24,117,27],[118,0,118,5],[118,6,118,11],[118,12,118,14],[118,15,118,17],[118,18,118,22],[118,24,118,27],[133,3,133,8],[133,9,133,11],[133,13,133,15],[133,17,133,18],[133,19,133,29],[125,0,137,1],[130,17,130,18],[131,17,131,18],[128,17,128,18],[132,3,132,8],[131,3,131,8],[131,13,131,15],[130,3,130,8],[129,3,129,8],[132,17,132,18],[128,19,128,29],[134,3,134,8],[134,9,134,11],[134,13,134,15],[134,17,134,18],[134,19,134,29],[135,3,135,8],[135,9,135,11],[135,13,135,15],[135,17,135,18],[135,19,135,29],[136,3,136,8],[136,9,136,11],[136,13,136,15],[136,17,136,18],[136,19,136,29],[137,3,137,8],[137,9,137,11],[137,13,137,15],[137,17,137,18],[137,19,137,29]]}
["様式9",null,null,null,null,null,null,null,null,null,null,null,null,null,null,null,null,null,null,null,null,null,null,null,null,null,"H",null,"（1/3）"]
["令和４年度 文化芸術による子供育成推進事業（芸術家の派遣事業）"]
["実施状況報告書"]
["あ","あ","あ","あ","あ","あ","あ","あ","あ","あ","あ","あ","あ","あ","あ","あ","あ","あ","あ","あ","あ","あ","あ","あ","あ","あ","あ","あ","あ","あ"]
["実施校ID",null,null,null,null,"H9999",null,null,null,null,null,null,null,null,null,"都道府県・\n政令指定都市",null,null,null,null,{"$f":"IF(【様式２・３】実施希望調書!E4=\"\",\"\",【様式２・３】実施希望調書!E4)","v":"北海道"}]
["実施校名",null,null,null,null,{"$f":"IF(【様式２・３】実施希望調書!E7=\"\",\"\",【様式２・３】実施希望調書!E7)","v":"○○市立文化小学校"},null,null,null,null,null,null,null,null,null,"学校長名",null,null,null,null,{"$f":"IF(【様式２・３】実施希望調書!W8=\"\",\"\",【様式２・３】実施希望調書!W8)","v":"◇◇　◇◇"}]
["全校児童生徒数",null,null,null,null,{"$f":"IF(【様式２・３】実施希望調書!W6=\"\",\"\",【様式２・３】実施希望調書!W6)","v":300},null,null,null,null,null,null,null,null,"名","担当者名",null,null,null,null,{"$f":"IF(【様式２・３】実施希望調書!W9=\"\",\"\",【様式２・３】実施希望調書!W9)","v":"□□　□□"}]
["実施会場",null,null,null,null,{"$f":"IF(【様式２・３】実施希望調書!E11=\"\",\"\",【様式２・３】実施希望調書!E11)","v":"実施校の教室・体育館"},null,null,null,null,null,null,null,null,null,"TEL",null,null,null,null,{"$f":"IF(【様式２・３】実施希望調書!E10=\"\",\"\",【様式２・３】実施希望調書!E10)","v":"00-0000-0000"}]
["他校との合同\n開催の状況",null,null,null,null,"（学校名）",null,null,{"$f":"IF(【様式２・３】実施希望調書!W11=\"\",\"\",【様式２・３】実施希望調書!W11)","v":"なし"},null,null,null,null,null,null,"メール",null,null,null,null,{"$f":"IF(【様式２・３】実施希望調書!W10=\"\",\"\",【様式２・３】実施希望調書!W10)","v":"xxx@xxxx.xx.xx"}]
["講師氏名※本名",null,null,null,null,{"$f":"IF(【様式２・３】実施希望調書!E16=\"\",\"\",【様式２・３】実施希望調書!E16)","v":"芸術　花子"},null,null,null,null,null,null,null,null,null,"実施回数",null,null,null,null,{"$f":"COUNTA(E34,E52,E72)-SUM(COUNTIF(E34,\"\"),COUNTIF(E52,\"\"),COUNTIF(E72,\"\"))","v":3},null,null,null,null,null,"回"]
["　芸術家の派遣事業実施による効果及び成果　\n　（A : とてもあてはまる　B : ややあてはまる　C: どちらでもない　D : あまりあてはまらない　E : あてはまらない　）"]
[]
[1,"（","A","）","文化芸術や伝統芸能等への関心を高めることができた"]
[2,"（","A","）","豊かな心や感性、創造性をはぐくむことができた"]
[3,"（","A","）","コミュニケーションの活性化に役立てることができた"]
[4,"（","A","）","ＣＤやDVD等では得られない反応があった"]
[5,"（","A","）","学校行事として文化芸術に関する行事が定着するきっかけとなった"]
[6,"（","A","）","学校教育の指導方法に役立てることができた"]
[7,"（","A","）","子どもたちの個性や能力を発見したり、理解する機会となった"]
[]
["  芸術家の派遣事業実施による変化や影響が見られたエピソード"]
["　（当てはまる対象に○をつけ、点線以下に具体的なエピソード等を記入してください）"]
[]
[1,"（","○","）","児童生徒",null,null,null,2,"（","○","）","教員",null,null,3,"（",null,"）","学校全体",null,null,null,4,"（",null,"）","その他"]
[]
["○○○○○○○○○○○○○○○○○○○○○○○○○○○○○○○○○○○○○○○○○○○○○○○○○○○○○○○○○○○○○○○○○○○○○○○○○○○○○○○○○○○○○○○○○○○○○○○○○○○○○○○○○○○○○○○○○○○○○○○○○○○○○○○○○○○○○○○○○○○○○○○○○○○○○○○○○○○○○○○○○○○○○○○○○○○○"]
["　芸術家の派遣事業を実施する魅力"]
["○○○○○○○○○○○○○○○○○○○○○○○○○○○○○○○○○○○○○○○○○○○○○○○○○○○○○○○○○○○○○○○○○○○○○○○○○○○○○○○○○○○○○○○○○○○○○○○○○○○○○○○○○○○○○○○○○○○○○○○○○○○○○○○○○○○○○○○○○○○○○○○○○○○○○○○○○○○○○○○○○○○○○○○○○○○○"]
["　芸術家の派遣事業をより良くするための意見等　※特に記載事項がない場合「なし」と記入してください"]
["○○○○○○○○○○○○○○○○○○○○○○○○○○○○○○○○○○○○○○○○○○○○○○○○○○○○○○○○○○○○○○○○○○○○○○○○○○○○○○○○○○○○○○○○○○○○○○○○○○○○○○○○○○○○○○○○○○○○○○○○○○○○○○○○○○○○○○○○○○○○○○○○○○○○○○○○○○○○○○○○○○○○○○○○○○○○"]
["様式9",null,null,null,null,null,null,null,null,null,null,null,null,null,null,null,null,null,null,null,null,null,null,null,null,null,"H",null,"（2/3）"]
["都道府県・政令指定都市",null,null,null,null,null,null,{"$f":"IF(U5=\"\",\"\",U5)","v":"北海道"},null,null,null,null,null,null,"実施校名",null,null,null,null,{"$f":"IF(F6=\"\",\"\",F6)","v":"○○市立文化小学校"}]
["※「教科の位置付け」：該当するものを選択し、内訳に詳細を記入してください\n※「参加児童生徒」：該当するものを選択してください。「学年単位」「その他」を選択した場合は内訳に詳細を記入してください"]
["第１回","実施日時",null,null,{"$f":"IF(【様式２・３】実施希望調書!E25=\"\",\"\",【様式２・３】実施希望調書!E25)","v":"2022-06-10"},null,null,null,null,null,null,null,null,null,null,"実施時間",null,null,{"$f":"IF(【様式２・３】実施希望調書!S25=\"\",\"\",【様式２・３】実施希望調書!S25)","v":"午前"},null,null,null,null,null,"実施\n合計",null,{"$f":"IF(【様式２・３】実施希望調書!AA25=\"\",\"\",【様式２・３】実施希望調書!AA25)","v":90},null,"分",null,null,{"$f":"IF(AA34=\"\",\"0\",IF(AA34>=150,3,IF(AND(AA34<150,AA34>=90),2,IF(AA34=\"\",0,1))))","v":2},null,"時間分の謝金計上可"]
[null,"教科の\n位置付け",null,null,{"$f":"IF(【様式２・３】実施希望調書!E27=\"\",\"\",【様式２・３】実施希望調書!E27)","v":"教科"},null,null,null,null,null,null,null,null,null,null,{"$f":"IFERROR(VLOOKUP(E35,選択肢!$Z$2:$AA$6,2,FALSE),\"\")","v":"教科名"},null,null,{"$f":"IF(【様式２・３】実施希望調書!S27=\"\",\"\",【様式２・３】実施希望調書!S27)","v":"音楽"}]
[null,"参加\n児童生徒",null,null,"合計",null,{"$f":"IF(【様式２・３】実施希望調書!G29=\"\",\"\",【様式２・３】実施希望調書!G29)","v":100},null,null,"人",null,"参加児童\n生徒単位",null,null,null,{"$f":"IF(【様式２・３】実施希望調書!P29=\"\",\"\",【様式２・３】実施希望調書!P29)","v":"学年単位"}]
[null,null,null,null,null,null,null,null,null,null,null,null,null,null,null,{"$f":"IFERROR(VLOOKUP(P36,選択肢!$AE$2:$AF$4,2,FALSE),\"\")","v":"内訳"},null,null,{"$f":"IF(【様式２・３】実施希望調書!S30=\"\",\"\",【様式２・３】実施希望調書!S30)","v":"5，6年生"}]
[null,"補助者",null,null,"氏名   ※本名",null,null,null,null,null,null,"種別・従事時間",null,null,null,null,null,null,null,null,null,null,null,null,null,null,"謝金合計"]
[null,null,null,null,"①",{"$f":"IF(【様式２・３】実施希望調書!F32=\"\",\"\",【様式２・３】実施希望調書!F32)","v":"次代　太郎"},null,null,null,null,null,"演奏",null,{"$f":"IF(【様式２・３】実施希望調書!N32=\"\",\"0\",【様式２・３】実施希望調書!N32)","v":1},"時間",null,"実技指導",null,{"$f":"IF(【様式２・３】実施希望調書!S32=\"\",\"0\",【様式２・３】実施希望調書!S32)","v":1},"時間",null,"単純労務",null,{"$f":"IF(【様式２・３】実施希望調書!X32=\"\",\"0\",【様式２・３】実施希望調書!X32)","v":"0"},"時間",null,{"$f":"(IF(N39=\"\",0,N39)*6520)+(IF(S39=\"\",0,S39)*5200)+(IF(X39=\"\",0,X39)*1070)","v":11720},null,null,null,null,{"$f":"IF(N39+S39>$AF$34,\"謝金計上可能上限時間を超えています。\",\"\")","v":""}]
[null,null,null,null,"②",{"$f":"IF(【様式２・３】実施希望調書!F33=\"\",\"\",【様式２・３】実施希望調書!F33)","v":"音楽　花子"},null,null,null,null,null,"演奏",null,{"$f":"IF(【様式２・３】実施希望調書!N33=\"\",\"0\",【様式２・３】実施希望調書!N33)","v":1},"時間",null,"実技指導",null,{"$f":"IF(【様式２・３】実施希望調書!S33=\"\",\"0\",【様式２・３】実施希望調書!S33)","v":1},"時間",null,"単純労務",null,{"$f":"IF(【様式２・３】実施希望調書!X33=\"\",\"0\",【様式２・３】実施希望調書!X33)","v":"0"},"時間",null,{"$f":"(IF(N40=\"\",0,N40)*6520)+(IF(S40=\"\",0,S40)*5200)+(IF(X40=\"\",0,X40)*1070)","v":11720},null,null,null,null,{"$f":"IF(N40+S40>$AF$34,\"謝金計上可能上限時間を超えています。\",\"\")","v":""}]
[null,null,null,null,"③",{"$f":"IF(【様式２・３】実施希望調書!F34=\"\",\"\",【様式２・３】実施希望調書!F34)","v":"演奏　太郎"},null,null,null,null,null,"演奏",null,{"$f":"IF(【様式２・３】実施希望調書!N34=\"\",\"0\",【様式２・３】実施希望調書!N34)","v":1},"時間",null,"実技指導",null,{"$f":"IF(【様式２・３】実施希望調書!S34=\"\",\"0\",【様式２・３】実施希望調書!S34)","v":1},"時間",null,"単純労務",null,{"$f":"IF(【様式２・３】実施希望調書!X34=\"\",\"0\",【様式２・３】実施希望調書!X34)","v":"0"},"時間",null,{"$f":"(IF(N41=\"\",0,N41)*6520)+(IF(S41=\"\",0,S41)*5200)+(IF(X41=\"\",0,X41)*1070)","v":11720},null,null,null,null,""]
[null,null,null,null,"④",{"$f":"IF(【様式２・３】実施希望調書!F35=\"\",\"\",【様式２・３】実施希望調書!F35)","v":""},null,null,null,null,null,"演奏",null,{"$f":"IF(【様式２・３】実施希望調書!N35=\"\",\"0\",【様式２・３】実施希望調書!N35)","v":"0"},"時間",null,"実技指導",null,{"$f":"IF(【様式２・３】実施希望調書!S35=\"\",\"0\",【様式２・３】実施希望調書!S35)","v":"0"},"時間",null,"単純労務",null,{"$f":"IF(【様式２・３】実施希望調書!X35=\"\",\"0\",【様式２・３】実施希望調書!X35)","v":"0"},"時間",null,{"$f":"(IF(N42=\"\",0,N42)*6520)+(IF(S42=\"\",0,S42)*5200)+(IF(X42=\"\",0,X42)*1070)","v":0},null,null,null,null,""]
[null,null,null,null,"⑤",{"$f":"IF(【様式２・３】実施希望調書!F36=\"\",\"\",【様式２・３】実施希望調書!F36)","v":""},null,null,null,null,null,"演奏",null,{"$f":"IF(【様式２・３】実施希望調書!N36=\"\",\"0\",【様式２・３】実施希望調書!N36)","v":"0"},"時間",null,"実技指導",null,{"$f":"IF(【様式２・３】実施希望調書!S36=\"\",\"0\",【様式２・３】実施希望調書!S36)","v":"0"},"時間",null,"単純労務",null,{"$f":"IF(【様式２・３】実施希望調書!X36=\"\",\"0\",【様式２・３】実施希望調書!X36)","v":"0"},"時間",null,{"$f":"(IF(N43=\"\",0,N43)*6520)+(IF(S43=\"\",0,S43)*5200)+(IF(X43=\"\",0,X43)*1070)","v":0},null,null,null,null,""]
[null,null,null,null,"⑥",{"$f":"IF(OR(OR(AND($F$8=\"文化施設等\",$I$9=\"\"),AND($F$8=\"文化施設等\",$I$9=\"なし\"),$F$8<>\"文化施設等\")),\"\",IF($E$34=\"\",\"\",IF(【様式２・３】実施希望調書!F37=\"\",\"\",【様式２・３】実施希望調書!F37)))","v":""},null,null,null,null,null,"演奏",null,{"$f":"IF(【様式２・３】実施希望調書!N37=\"\",\"0\",【様式２・３】実施希望調書!N37)","v":"0"},"時間",null,"実技指導",null,{"$f":"IF(【様式２・３】実施希望調書!S37=\"\",\"0\",【様式２・３】実施希望調書!S37)","v":"0"},"時間",null,"単純労務",null,{"$f":"IF(【様式２・３】実施希望調書!X37=\"\",\"0\",【様式２・３】実施希望調書!X37)","v":"0"},"時間",null,{"$f":"IF(OR(OR(AND($F$8=\"文化施設等\",$I$9=\"\"),AND($F$8=\"文化施設等\",$I$9=\"なし\"),$F$8<>\"文化施設等\")),0,(IF(N44=\"\",0,N44)*6520)+(IF(S44=\"\",0,S44)*5200)+(IF(X44=\"\",0,X44)*1070))","v":0},null,null,null,null,""]
[null,null,null,null,"⑦",{"$f":"IF(OR(OR(AND($F$8=\"文化施設等\",$I$9=\"\"),AND($F$8=\"文化施設等\",$I$9=\"なし\"),$F$8<>\"文化施設等\")),\"\",IF($E$34=\"\",\"\",IF(【様式２・３】実施希望調書!F38=\"\",\"\",【様式２・３】実施希望調書!F38)))","v":""},null,null,null,null,null,"演奏",null,{"$f":"IF(【様式２・３】実施希望調書!N38=\"\",\"0\",【様式２・３】実施希望調書!N38)","v":"0"},"時間",null,"実技指導",null,{"$f":"IF(【様式２・３】実施希望調書!S38=\"\",\"0\",【様式２・３】実施希望調書!S38)","v":"0"},"時間",null,"単純労務",null,{"$f":"IF(【様式２・３】実施希望調書!X38=\"\",\"0\",【様式２・３】実施希望調書!X38)","v":"0"},"時間",null,{"$f":"IF(OR(OR(AND($F$8=\"文化施設等\",$I$9=\"\"),AND($F$8=\"文化施設等\",$I$9=\"なし\"),$F$8<>\"文化施設等\")),0,(IF(N45=\"\",0,N45)*6520)+(IF(S45=\"\",0,S45)*5200)+(IF(X45=\"\",0,X45)*1070))","v":0},null,null,null,null,""]
[null,null,null,null,"⑧",{"$f":"IF(OR(OR(AND($F$8=\"文化施設等\",$I$9=\"\"),AND($F$8=\"文化施設等\",$I$9=\"なし\"),$F$8<>\"文化施設等\")),\"\",IF($E$34=\"\",\"\",IF(【様式２・３】実施希望調書!F39=\"\",\"\",【様式２・３】実施希望調書!F39)))","v":""},null,null,null,null,null,"演奏",null,{"$f":"IF(【様式２・３】実施希望調書!N39=\"\",\"0\",【様式２・３】実施希望調書!N39)","v":"0"},"時間",null,"実技指導",null,{"$f":"IF(【様式２・３】実施希望調書!S39=\"\",\"0\",【様式２・３】実施希望調書!S39)","v":"0"},"時間",null,"単純労務",null,{"$f":"IF(【様式２・３】実施希望調書!X39=\"\",\"0\",【様式２・３】実施希望調書!X39)","v":"0"},"時間",null,{"$f":"IF(OR(OR(AND($F$8=\"文化施設等\",$I$9=\"\"),AND($F$8=\"文化施設等\",$I$9=\"なし\"),$F$8<>\"文化施設等\")),0,(IF(N46=\"\",0,N46)*6520)+(IF(S46=\"\",0,S46)*5200)+(IF(X46=\"\",0,X46)*1070))","v":0},null,null,null,null,""]
[null,null,null,null,"計",{"$f":"IF(OR(OR(AND($F$8=\"文化施設等\",$I$9=\"\"),AND($F$8=\"文化施設等\",$I$9=\"なし\"),$F$8<>\"文化施設等\")),COUNTIF(F39:F43,\"?*\"),COUNTIF(F39:F46,\"?*\"))","v":3},null,null,null,null,"人","※各1時間当たり　演奏6,520円、実技指導5,200円、単純労務1,070円",null,null,null,null,null,null,null,null,null,null,null,null,null,"計",{"$f":"SUM(AA39:AD46)","v":35160}]
[null,"  事業内容  （具体的な内容をお書きください）"]
[null,{"$f":"IF(【様式２・３】実施希望調書!B42=\"\",\"\",【様式２・３】実施希望調書!B42)","v":"○○○○○○○○○○○○○○○○○○○○○○○○○○○○○○○○○○○○○○○○○○○○○○○○○○○○○○○○○○○○○○○○○○○○○○○○○○○○○○○○○○○○○○○○○○○○○○○○○○○○○○○○○○○○○○○○○○○○○○○○○○○○○○○○○○○○○○○○○○○○○○○○○○○○○○○○○○○○○○○○○○○○○○○○○○○○"}]
[null," 児童生徒の反応等  （具体的な内容をお書きください）"]
[null,"○○○○○○○○○○○○○○○○○○○○○○○○○○○○○○○○○○○○○○○○○○○○○○○○○○○○○○○○○○○○○○○○○○○○○○○○○○○○○○○○○○○○○○○○○○○○○○○○○○○○○○○○○○○○○○○○○○○○○○○○○○○○○○○○○○○○○○○○○○○○○○○○○○○○○○○○○○○○○○○○○○○○○○○○○○○○"]
["第２回","実施日時",null,null,{"$f":"IF(【様式２・３】実施希望調書!E43=\"\",\"\",【様式２・３】実施希望調書!E43)","v":"2022-06-17"},null,null,null,null,null,null,null,null,null,null,"実施時間",null,null,{"$f":"IF(【様式２・３】実施希望調書!S43=\"\",\"\",【様式２・３】実施希望調書!S43)","v":"午後"},null,null,null,null,null,"実施\n合計",null,{"$f":"IF(【様式２・３】実施希望調書!AA43=\"\",\"\",【様式２・３】実施希望調書!AA43)","v":150},null,"分",null,null,{"$f":"IF(AA52=\"\",\"0\",IF(AA52>=150,3,IF(AND(AA52<150,AA52>=90),2,IF(AA52=\"\",0,1))))","v":3},null,"時間分の謝金計上可"]
[null,"教科の\n位置付け",null,null,{"$f":"IF(【様式２・３】実施希望調書!E45=\"\",\"\",【様式２・３】実施希望調書!E45)","v":"総合的な学習の時間"},null,null,null,null,null,null,null,null,null,null,{"$f":"IFERROR(VLOOKUP(E53,選択肢!$Z$2:$AA$6,2,FALSE),\"\")","v":"　"},null,null,{"$f":"IF(【様式２・３】実施希望調書!S45=\"\",\"\",【様式２・３】実施希望調書!S45)","v":""}]
[null,"参加\n児童生徒",null,null,"合計",null,{"$f":"IF(【様式２・３】実施希望調書!G47=\"\",\"\",【様式２・３】実施希望調書!G47)","v":100},null,null,"人",null,"参加児童\n生徒単位",null,null,null,{"$f":"IF(【様式２・３】実施希望調書!P47=\"\",\"\",【様式２・３】実施希望調書!P47)","v":"学年単位"}]
[null,null,null,null,null,null,null,null,null,null,null,null,null,null,null,{"$f":"IFERROR(VLOOKUP(P54,選択肢!$AE$2:$AF$4,2,FALSE),\"\")","v":"内訳"},null,null,{"$f":"IF(【様式２・３】実施希望調書!S48=\"\",\"\",【様式２・３】実施希望調書!S48)","v":"5，6年生"}]
[null,"補助者",null,null,"氏名   ※本名",null,null,null,null,null,null,"種別・従事時間",null,null,null,null,null,null,null,null,null,null,null,null,null,null,"謝金合計"]
[null,null,null,null,"①",{"$f":"IF($E$52=\"\",\"\",IF(【様式２・３】実施希望調書!F50=\"\",\"\",【様式２・３】実施希望調書!F50))","v":"次代　太郎"},null,null,null,null,null,"演奏",null,{"$f":"IF(【様式２・３】実施希望調書!N50=\"\",\"0\",【様式２・３】実施希望調書!N50)","v":2},"時間",null,"実技指導",null,{"$f":"IF(【様式２・３】実施希望調書!S50=\"\",\"0\",【様式２・３】実施希望調書!S50)","v":1},"時間",null,"単純労務",null,{"$f":"IF(【様式２・３】実施希望調書!X50=\"\",\"0\",【様式２・３】実施希望調書!X50)","v":"0"},"時間",null,{"$f":"(IF(N57=\"\",0,N57)*6520)+(IF(S57=\"\",0,S57)*5200)+(IF(X57=\"\",0,X57)*1070)","v":18240},null,null,null,null,{"$f":"IF(N57+S57>$AF$52,\"謝金計上可能上限時間を超えています。\",\"\")","v":""}]
[null,null,null,null,"②",{"$f":"IF($E$52=\"\",\"\",IF(【様式２・３】実施希望調書!F51=\"\",\"\",【様式２・３】実施希望調書!F51))","v":"音楽　花子"},null,null,null,null,null,"演奏",null,{"$f":"IF(【様式２・３】実施希望調書!N51=\"\",\"0\",【様式２・３】実施希望調書!N51)","v":2},"時間",null,"実技指導",null,{"$f":"IF(【様式２・３】実施希望調書!S51=\"\",\"0\",【様式２・３】実施希望調書!S51)","v":1},"時間",null,"単純労務",null,{"$f":"IF(【様式２・３】実施希望調書!X51=\"\",\"0\",【様式２・３】実施希望調書!X51)","v":"0"},"時間",null,{"$f":"(IF(N58=\"\",0,N58)*6520)+(IF(S58=\"\",0,S58)*5200)+(IF(X58=\"\",0,X58)*1070)","v":18240},null,null,null,null,{"$f":"IF(N58+S58>$AF$52,\"謝金計上可能上限時間を超えています。\",\"\")","v":""}]
[null,null,null,null,"③",{"$f":"IF($E$52=\"\",\"\",IF(【様式２・３】実施希望調書!F52=\"\",\"\",【様式２・３】実施希望調書!F52))","v":"演奏　太郎"},null,null,null,null,null,"演奏",null,{"$f":"IF(【様式２・３】実施希望調書!N52=\"\",\"0\",【様式２・３】実施希望調書!N52)","v":2},"時間",null,"実技指導",null,{"$f":"IF(【様式２・３】実施希望調書!S52=\"\",\"0\",【様式２・３】実施希望調書!S52)","v":1},"時間",null,"単純労務",null,{"$f":"IF(【様式２・３】実施希望調書!X52=\"\",\"0\",【様式２・３】実施希望調書!X52)","v":"0"},"時間",null,{"$f":"(IF(N59=\"\",0,N59)*6520)+(IF(S59=\"\",0,S59)*5200)+(IF(X59=\"\",0,X59)*1070)","v":18240},null,null,null,null,""]
[null,null,null,null,"④",{"$f":"IF($E$52=\"\",\"\",IF(【様式２・３】実施希望調書!F53=\"\",\"\",【様式２・３】実施希望調書!F53))","v":""},null,null,null,null,null,"演奏",null,{"$f":"IF(【様式２・３】実施希望調書!N53=\"\",\"0\",【様式２・３】実施希望調書!N53)","v":"0"},"時間",null,"実技指導",null,{"$f":"IF(【様式２・３】実施希望調書!S53=\"\",\"0\",【様式２・３】実施希望調書!S53)","v":"0"},"時間",null,"単純労務",null,{"$f":"IF(【様式２・３】実施希望調書!X53=\"\",\"0\",【様式２・３】実施希望調書!X53)","v":"0"},"時間",null,{"$f":"(IF(N60=\"\",0,N60)*6520)+(IF(S60=\"\",0,S60)*5200)+(IF(X60=\"\",0,X60)*1070)","v":0},null,null,null,null,""]
[null,null,null,null,"⑤",{"$f":"IF($E$52=\"\",\"\",IF(【様式２・３】実施希望調書!F54=\"\",\"\",【様式２・３】実施希望調書!F54))","v":""},null,null,null,null,null,"演奏",null,{"$f":"IF(【様式２・３】実施希望調書!N54=\"\",\"0\",【様式２・３】実施希望調書!N54)","v":"0"},"時間",null,"実技指導",null,{"$f":"IF(【様式２・３】実施希望調書!S54=\"\",\"0\",【様式２・３】実施希望調書!S54)","v":"0"},"時間",null,"単純労務",null,{"$f":"IF(【様式２・３】実施希望調書!X54=\"\",\"0\",【様式２・３】実施希望調書!X54)","v":"0"},"時間",null,{"$f":"(IF(N61=\"\",0,N61)*6520)+(IF(S61=\"\",0,S61)*5200)+(IF(X61=\"\",0,X61)*1070)","v":0},null,null,null,null,""]
[null,null,null,null,"⑥",{"$f":"IF(OR(OR(AND($F$8=\"文化施設等\",$I$9=\"\"),AND($F$8=\"文化施設等\",$I$9=\"なし\"),$F$8<>\"文化施設等\")),\"\",IF($E$52=\"\",\"\",IF(【様式２・３】実施希望調書!F55=\"\",\"\",【様式２・３】実施希望調書!F55)))","v":""},null,null,null,null,null,"演奏",null,{"$f":"IF(【様式２・３】実施希望調書!N55=\"\",\"0\",【様式２・３】実施希望調書!N55)","v":"0"},"時間",null,"実技指導",null,{"$f":"IF(【様式２・３】実施希望調書!S55=\"\",\"0\",【様式２・３】実施希望調書!S55)","v":"0"},"時間",null,"単純労務",null,{"$f":"IF(【様式２・３】実施希望調書!X55=\"\",\"0\",【様式２・３】実施希望調書!X55)","v":"0"},"時間",null,{"$f":"IF(OR(OR(AND($F$8=\"文化施設等\",$I$9=\"\"),AND($F$8=\"文化施設等\",$I$9=\"なし\"),$F$8<>\"文化施設等\")),0,(IF(N62=\"\",0,N62)*6520)+(IF(S62=\"\",0,S62)*5200)+(IF(X62=\"\",0,X62)*1070))","v":0},null,null,null,null,""]
[null,null,null,null,"⑦",{"$f":"IF(OR(OR(AND($F$8=\"文化施設等\",$I$9=\"\"),AND($F$8=\"文化施設等\",$I$9=\"なし\"),$F$8<>\"文化施設等\")),\"\",IF($E$52=\"\",\"\",IF(【様式２・３】実施希望調書!F56=\"\",\"\",【様式２・３】実施希望調書!F56)))","v":""},null,null,null,null,null,"演奏",null,{"$f":"IF(【様式２・３】実施希望調書!N56=\"\",\"0\",【様式２・３】実施希望調書!N56)","v":"0"},"時間",null,"実技指導",null,{"$f":"IF(【様式２・３】実施希望調書!S56=\"\",\"0\",【様式２・３】実施希望調書!S56)","v":"0"},"時間",null,"単純労務",null,{"$f":"IF(【様式２・３】実施希望調書!X56=\"\",\"0\",【様式２・３】実施希望調書!X56)","v":"0"},"時間",null,{"$f":"IF(OR(OR(AND($F$8=\"文化施設等\",$I$9=\"\"),AND($F$8=\"文化施設等\",$I$9=\"なし\"),$F$8<>\"文化施設等\")),0,(IF(N63=\"\",0,N63)*6520)+(IF(S63=\"\",0,S63)*5200)+(IF(X63=\"\",0,X63)*1070))","v":0},null,null,null,null,""]
[null,null,null,null,"⑧",{"$f":"IF(OR(OR(AND($F$8=\"文化施設等\",$I$9=\"\"),AND($F$8=\"文化施設等\",$I$9=\"なし\"),$F$8<>\"文化施設等\")),\"\",IF($E$52=\"\",\"\",IF(【様式２・３】実施希望調書!F57=\"\",\"\",【様式２・３】実施希望調書!F57)))","v":""},null,null,null,null,null,"演奏",null,{"$f":"IF(【様式２・３】実施希望調書!N57=\"\",\"0\",【様式２・３】実施希望調書!N57)","v":"0"},"時間",null,"実技指導",null,{"$f":"IF(【様式２・３】実施希望調書!S57=\"\",\"0\",【様式２・３】実施希望調書!S57)","v":"0"},"時間",null,"単純労務",null,{"$f":"IF(【様式２・３】実施希望調書!X57=\"\",\"0\",【様式２・３】実施希望調書!X57)","v":"0"},"時間",null,{"$f":"IF(OR(OR(AND($F$8=\"文化施設等\",$I$9=\"\"),AND($F$8=\"文化施設等\",$I$9=\"なし\"),$F$8<>\"文化施設等\")),0,(IF(N64=\"\",0,N64)*6520)+(IF(S64=\"\",0,S64)*5200)+(IF(X64=\"\",0,X64)*1070))","v":0},null,null,null,null,""]
[null,null,null,null,"計",{"$f":"IF(OR(OR(AND($F$8=\"文化施設等\",$I$9=\"\"),AND($F$8=\"文化施設等\",$I$9=\"なし\"),$F$8<>\"文化施設等\")),COUNTIF(F57:F61,\"?*\"),COUNTIF(F57:F64,\"?*\"))","v":3},null,null,null,null,"人","※各1時間当たり　演奏6,520円、実技指導5,200円、単純労務1,070円",null,null,null,null,null,null,null,null,null,null,null,null,null,"計",{"$f":"SUM(AA57:AD64)","v":54720}]
[null,"  事業内容  （具体的な内容をお書きください）"]
[null,{"$f":"IF(【様式２・３】実施希望調書!B60=\"\",\"\",【様式２・３】実施希望調書!B60)","v":"○○○○○○○○○○○○○○○○○○○○○○○○○○○○○○○○○○○○○○○○○○○○○○○○○○○○○○○○○○○○○○○○○○○○○○○○○○○○○○○○○○○○○○○○○○○○○○○○○○○○○○○○○○○○○○○○○○○○○○○○○○○○○○○○○○○○○○○○○○○○○○○○○○○○○○○○○○○○○○○○○○○○○○○○○○○○"}]
[null," 児童生徒の反応等  （具体的な内容をお書きください）"]
[null,"○○○○○○○○○○○○○○○○○○○○○○○○○○○○○○○○○○○○○○○○○○○○○○○○○○○○○○○○○○○○○○○○○○○○○○○○○○○○○○○○○○○○○○○○○○○○○○○○○○○○○○○○○○○○○○○○○○○○○○○○○○○○○○○○○○○○○○○○○○○○○○○○○○○○○○○○○○○○○○○○○○○○○○○○○○○○"]
["様式9",null,null,null,null,null,null,null,null,null,null,null,null,null,null,null,null,null,null,null,null,null,null,null,null,null,"H",null,"（3/3）"]
["都道府県・政令指定都市",null,null,null,null,null,null,{"$f":"IF(U5=\"\",\"\",U5)","v":"北海道"},null,null,null,null,null,null,"実施校名",null,null,null,null,{"$f":"IF(F6=\"\",\"\",F6)","v":"○○市立文化小学校"}]
["第３回","実施日時",null,null,{"$f":"IF(【様式２・３】実施希望調書!E61=\"\",\"\",【様式２・３】実施希望調書!E61)","v":"2022-06-23"},null,null,null,null,null,null,null,null,null,null,"実施時間",null,null,{"$f":"IF(【様式２・３】実施希望調書!S61=\"\",\"\",【様式２・３】実施希望調書!S61)","v":"午前と午後"},null,null,null,null,null,"実施\n合計",null,{"$f":"IF(【様式２・３】実施希望調書!AA61=\"\",\"\",【様式２・３】実施希望調書!AA61)","v":150},null,"分",null,null,{"$f":"IF(AA72=\"\",\"0\",IF(AA72>=150,3,IF(AND(AA72<150,AA72>=90),2,IF(AA72=\"\",0,1))))","v":3},null,"時間分の謝金計上可"]
[null,"教科の\n位置付け",null,null,{"$f":"IF(【様式２・３】実施希望調書!E63=\"\",\"\",【様式２・３】実施希望調書!E63)","v":"特別活動"},null,null,null,null,null,null,null,null,null,null,{"$f":"IFERROR(VLOOKUP(E73,選択肢!$Z$2:$AA$6,2,FALSE),\"\")","v":"特別活動名"},null,null,{"$f":"IF(【様式２・３】実施希望調書!S63=\"\",\"\",【様式２・３】実施希望調書!S63)","v":"文化的行事"}]
[null,"参加\n児童生徒",null,null,"合計",null,{"$f":"IF(【様式２・３】実施希望調書!G65=\"\",\"\",【様式２・３】実施希望調書!G65)","v":300},null,null,"人",null,"参加児童\n生徒単位",null,null,null,{"$f":"IF(【様式２・３】実施希望調書!P65=\"\",\"\",【様式２・３】実施希望調書!P65)","v":"全校児童/生徒"}]
[null,null,null,null,null,null,null,null,null,null,null,null,null,null,null,{"$f":"IFERROR(VLOOKUP(P74,選択肢!$AE$2:$AF$4,2,FALSE),\"\")","v":""},null,null,{"$f":"IF(【様式２・３】実施希望調書!S66=\"\",\"\",【様式２・３】実施希望調書!S66)","v":""}]
[null,"補助者",null,null,"氏名   ※本名",null,null,null,null,null,null,"種別・従事時間",null,null,null,null,null,null,null,null,null,null,null,null,null,null,"謝金合計"]
[null,null,null,null,"①",{"$f":"IF($E$72=\"\",\"\",IF(【様式２・３】実施希望調書!F68=\"\",\"\",【様式２・３】実施希望調書!F68))","v":"次代　太郎"},null,null,null,null,null,"演奏",null,{"$f":"IF(【様式２・３】実施希望調書!N68=\"\",\"0\",【様式２・３】実施希望調書!N68)","v":2},"時間",null,"実技指導",null,{"$f":"IF(【様式２・３】実施希望調書!S68=\"\",\"0\",【様式２・３】実施希望調書!S68)","v":1},"時間",null,"単純労務",null,{"$f":"IF(【様式２・３】実施希望調書!X68=\"\",\"0\",【様式２・３】実施希望調書!X68)","v":"0"},"時間",null,{"$f":"(IF(N77=\"\",0,N77)*6520)+(IF(S77=\"\",0,S77)*5200)+(IF(X77=\"\",0,X77)*1070)","v":18240},null,null,null,null,{"$f":"IF(N77+S77>$AF$72,\"謝金計上可能上限時間を超えています。\",\"\")","v":""}]
[null,null,null,null,"②",{"$f":"IF($E$72=\"\",\"\",IF(【様式２・３】実施希望調書!F69=\"\",\"\",【様式２・３】実施希望調書!F69))","v":"音楽　花子"},null,null,null,null,null,"演奏",null,{"$f":"IF(【様式２・３】実施希望調書!N69=\"\",\"0\",【様式２・３】実施希望調書!N69)","v":2},"時間",null,"実技指導",null,{"$f":"IF(【様式２・３】実施希望調書!S69=\"\",\"0\",【様式２・３】実施希望調書!S69)","v":"0"},"時間",null,"単純労務",null,{"$f":"IF(【様式２・３】実施希望調書!X69=\"\",\"0\",【様式２・３】実施希望調書!X69)","v":"0"},"時間",null,{"$f":"(IF(N78=\"\",0,N78)*6520)+(IF(S78=\"\",0,S78)*5200)+(IF(X78=\"\",0,X78)*1070)","v":13040},null,null,null,null,{"$f":"IF(N78+S78>$AF$72,\"謝金計上可能上限時間を超えています。\",\"\")","v":""}]
[null,null,null,null,"③",{"$f":"IF($E$72=\"\",\"\",IF(【様式２・３】実施希望調書!F70=\"\",\"\",【様式２・３】実施希望調書!F70))","v":"演奏　太郎"},null,null,null,null,null,"演奏",null,{"$f":"IF(【様式２・３】実施希望調書!N70=\"\",\"0\",【様式２・３】実施希望調書!N70)","v":2},"時間",null,"実技指導",null,{"$f":"IF(【様式２・３】実施希望調書!S70=\"\",\"0\",【様式２・３】実施希望調書!S70)","v":"0"},"時間",null,"単純労務",null,{"$f":"IF(【様式２・３】実施希望調書!X70=\"\",\"0\",【様式２・３】実施希望調書!X70)","v":"0"},"時間",null,{"$f":"(IF(N79=\"\",0,N79)*6520)+(IF(S79=\"\",0,S79)*5200)+(IF(X79=\"\",0,X79)*1070)","v":13040},null,null,null,null,""]
[null,null,null,null,"④",{"$f":"IF($E$72=\"\",\"\",IF(【様式２・３】実施希望調書!F71=\"\",\"\",【様式２・３】実施希望調書!F71))","v":"弦楽　花子"},null,null,null,null,null,"演奏",null,{"$f":"IF(【様式２・３】実施希望調書!N71=\"\",\"0\",【様式２・３】実施希望調書!N71)","v":2},"時間",null,"実技指導",null,{"$f":"IF(【様式２・３】実施希望調書!S71=\"\",\"0\",【様式２・３】実施希望調書!S71)","v":"0"},"時間",null,"単純労務",null,{"$f":"IF(【様式２・３】実施希望調書!X71=\"\",\"0\",【様式２・３】実施希望調書!X71)","v":"0"},"時間",null,{"$f":"(IF(N80=\"\",0,N80)*6520)+(IF(S80=\"\",0,S80)*5200)+(IF(X80=\"\",0,X80)*1070)","v":13040},null,null,null,null,""]
[null,null,null,null,"⑤",{"$f":"IF($E$72=\"\",\"\",IF(【様式２・３】実施希望調書!F72=\"\",\"\",【様式２・３】実施希望調書!F72))","v":"鍵盤　太郎"},null,null,null,null,null,"演奏",null,{"$f":"IF(【様式２・３】実施希望調書!N72=\"\",\"0\",【様式２・３】実施希望調書!N72)","v":2},"時間",null,"実技指導",null,{"$f":"IF(【様式２・３】実施希望調書!S72=\"\",\"0\",【様式２・３】実施希望調書!S72)","v":"0"},"時間",null,"単純労務",null,{"$f":"IF(【様式２・３】実施希望調書!X72=\"\",\"0\",【様式２・３】実施希望調書!X72)","v":"0"},"時間",null,{"$f":"(IF(N81=\"\",0,N81)*6520)+(IF(S81=\"\",0,S81)*5200)+(IF(X81=\"\",0,X81)*1070)","v":13040},null,null,null,null,""]
[null,null,null,null,"⑥",{"$f":"IF(OR(OR(AND($F$8=\"文化施設等\",$I$9=\"\"),AND($F$8=\"文化施設等\",$I$9=\"なし\"),$F$8<>\"文化施設等\")),\"\",IF($E$72=\"\",\"\",IF(【様式２・３】実施希望調書!F73=\"\",\"\",【様式２・３】実施希望調書!F73)))","v":""},null,null,null,null,null,"演奏",null,{"$f":"IF(【様式２・３】実施希望調書!N73=\"\",\"0\",【様式２・３】実施希望調書!N73)","v":"0"},"時間",null,"実技指導",null,{"$f":"IF(【様式２・３】実施希望調書!S73=\"\",\"0\",【様式２・３】実施希望調書!S73)","v":"0"},"時間",null,"単純労務",null,{"$f":"IF(【様式２・３】実施希望調書!X73=\"\",\"0\",【様式２・３】実施希望調書!X73)","v":"0"},"時間",null,{"$f":"IF(OR(OR(AND($F$8=\"文化施設等\",$I$9=\"\"),AND($F$8=\"文化施設等\",$I$9=\"なし\"),$F$8<>\"文化施設等\")),0,(IF(N82=\"\",0,N82)*6520)+(IF(S82=\"\",0,S82)*5200)+(IF(X82=\"\",0,X82)*1070))","v":0},null,null,null,null,""]
[null,null,null,null,"⑦",{"$f":"IF(OR(OR(AND($F$8=\"文化施設等\",$I$9=\"\"),AND($F$8=\"文化施設等\",$I$9=\"なし\"),$F$8<>\"文化施設等\")),\"\",IF($E$72=\"\",\"\",IF(【様式２・３】実施希望調書!F74=\"\",\"\",【様式２・３】実施希望調書!F74)))","v":""},null,null,null,null,null,"演奏",null,{"$f":"IF(【様式２・３】実施希望調書!N74=\"\",\"0\",【様式２・３】実施希望調書!N74)","v":"0"},"時間",null,"実技指導",null,{"$f":"IF(【様式２・３】実施希望調書!S74=\"\",\"0\",【様式２・３】実施希望調書!S74)","v":"0"},"時間",null,"単純労務",null,{"$f":"IF(【様式２・３】実施希望調書!X74=\"\",\"0\",【様式２・３】実施希望調書!X74)","v":"0"},"時間",null,{"$f":"IF(OR(OR(AND($F$8=\"文化施設等\",$I$9=\"\"),AND($F$8=\"文化施設等\",$I$9=\"なし\"),$F$8<>\"文化施設等\")),0,(IF(N83=\"\",0,N83)*6520)+(IF(S83=\"\",0,S83)*5200)+(IF(X83=\"\",0,X83)*1070))","v":0},null,null,null,null,""]
[null,null,null,null,"⑧",{"$f":"IF(OR(OR(AND($F$8=\"文化施設等\",$I$9=\"\"),AND($F$8=\"文化施設等\",$I$9=\"なし\"),$F$8<>\"文化施設等\")),\"\",IF($E$72=\"\",\"\",IF(【様式２・３】実施希望調書!F75=\"\",\"\",【様式２・３】実施希望調書!F75)))","v":""},null,null,null,null,null,"演奏",null,{"$f":"IF(【様式２・３】実施希望調書!N75=\"\",\"0\",【様式２・３】実施希望調書!N75)","v":"0"},"時間",null,"実技指導",null,{"$f":"IF(【様式２・３】実施希望調書!S75=\"\",\"0\",【様式２・３】実施希望調書!S75)","v":"0"},"時間",null,"単純労務",null,{"$f":"IF(【様式２・３】実施希望調書!X75=\"\",\"0\",【様式２・３】実施希望調書!X75)","v":"0"},"時間",null,{"$f":"IF(OR(OR(AND($F$8=\"文化施設等\",$I$9=\"\"),AND($F$8=\"文化施設等\",$I$9=\"なし\"),$F$8<>\"文化施設等\")),0,(IF(N84=\"\",0,N84)*6520)+(IF(S84=\"\",0,S84)*5200)+(IF(X84=\"\",0,X84)*1070))","v":0},null,null,null,null,""]
[null,null,null,null,"計",{"$f":"IF(OR(OR(AND($F$8=\"文化施設等\",$I$9=\"\"),AND($F$8=\"文化施設等\",$I$9=\"なし\"),$F$8<>\"文化施設等\")),COUNTIF(F77:F81,\"?*\"),COUNTIF(F77:F84,\"?*\"))","v":5},null,null,null,null,"人","※各1時間当たり　演奏6,520円、実技指導5,200円、単純労務1,070円",null,null,null,null,null,null,null,null,null,null,null,null,null,"計",{"$f":"SUM(AA77:AD84)","v":70400}]
[null,"  事業内容  （具体的な内容をお書きください）"]
[null,{"$f":"IF(【様式２・３】実施希望調書!B78=\"\",\"\",【様式２・３】実施希望調書!B78)","v":"○○○○○○○○○○○○○○○○○○○○○○○○○○○○○○○○○○○○○○○○○○○○○○○○○○○○○○○○○○○○○○○○○○○○○○○○○○○○○○○○○○○○○○○○○○○○○○○○○○○○○○○○○○○○○○○○○○○○○○○○○○○○○○○○○○○○○○○○○○○○○○○○○○○○○○○○○○○○○○○○○○○○○○○○○○○○"}]
[null," 児童生徒の反応等  （具体的な内容をお書きください）"]
[null,"○○○○○○○○○○○○○○○○○○○○○○○○○○○○○○○○○○○○○○○○○○○○○○○○○○○○○○○○○○○○○○○○○○○○○○○○○○○○○○○○○○○○○○○○○○○○○○○○○○○○○○○○○○○○○○○○○○○○○○○○○○○○○○○○○○○○○○○○○○○○○○○○○○○○○○○○○○○○○○○○○○○○○○○○○○○○"]
[]
["様式10",null,null,null,null,null,null,null,null,null,null,null,null,null,null,null,null,null,null,null,null,null,null,null,"実施校ID",{"$f":"IF(F5=\"\",\"\",F5)","v":"H9999"}]
["令和４年度 文化芸術による子供育成推進事業（芸術家の派遣事業）"]
["経費報告書兼支払依頼書"]
["実施日",null,null,null,"第１回",null,null,null,"第２回",null,null,null,"第３回",null,null,null,null,"都道府県・政令指定都市",null,null,null,null,null,{"$f":"IF(U5=\"\",\"\",U5)","v":"北海道"}]
[null,null,null,null,{"$f":"IF(E34=\"\",\"\",E34)","v":"2022-06-10"},null,null,null,{"$f":"IF(E52=\"\",\"\",E52)","v":"2022-06-17"},null,null,null,{"$f":"IF(E72=\"\",\"\",E72)","v":"2022-06-23"},null,null,null,null,"実施校名",null,null,{"$f":"IF(F6=\"\",\"\",F6)","v":"○○市立文化小学校"}]
[]
["【決算総括表】",null,null,null,null,null,"※決定額：決定通知の金額が反映されます"]
["区分",null,null,null,null,null,"決定額（予算額）",null,null,null,null,null,"決算額",null,null,null,null,null,"差額（決算額－予算額）"]
["①","謝金",null,null,null,null,{"$f":"【様式２・３】実施希望調書!M107","v":267230},null,null,null,null,"円","a",{"$f":"S120","v":267230},null,null,null,"円",{"$f":"N99-G99","v":0},null,null,null,null,"円"]
["②","旅費",null,null,null,null,{"$f":"【様式２・３】実施希望調書!S107","v":65590},null,null,null,null,"円","b",{"$f":"N139","v":65390},null,null,null,"円",{"$f":"N100-G100","v":-200},null,null,null,null,"円"]
["③","講演等諸雑費",null,null,null,null,{"$f":"【様式２・３】実施希望調書!Y122","v":48700},null,null,null,null,"円","c",{"$f":"Y150","v":48700},null,null,null,"円",{"$f":"N101-G101","v":0},null,null,null,null,"円"]
["合計",null,null,null,null,null,{"$f":"SUM(G99:K101)","v":381520},null,null,null,null,"円",{"$f":"SUM(N99:Q101)","v":381320},null,null,null,null,"円",{"$f":"SUM(S99:W101)","v":-200},null,null,null,null,"円"]
[]
["【①謝金】",null,null,null,null,null,"※補助者氏名が自動反映されない場合は、氏名欄の▼プルダウンリストから選択してください\n※Bank ID（取引先ID）について、各従事者に確認の上、「4桁-1桁」の数字を記入してください"]
["種別",null,null,null,null,null,"氏名　※本名",null,null,null,null,null,"発注年月日",null,null,"引取年月日",null,null,"謝金",null,null,null,null,null,"Bank ID（取引先ID）"]
["講師",null,null,null,null,null,{"$f":"IF(F10=\"\",\"\",F10)","v":"芸術　花子"},null,null,null,null,null,"決定通知記載日",null,null,"全回",null,null,{"$f":"IF(G106=\"\",\"0\",U10*35650)","v":106950},null,null,null,null,"円",9990,null,null,null,"-",1]
["補助者①",null,null,null,null,null,{"$f":"IF(F39=\"\",\"　\",F39)","v":"次代　太郎"},null,null,null,null,null,"決定通知記載日",null,null,"全回",null,null,{"$f":"SUM(IFERROR(VLOOKUP(G107,$F$39:$AD$46,22,FALSE),0),IFERROR(VLOOKUP(G107,$F$57:$AD$64,22,FALSE),0),IFERROR(VLOOKUP(G107,$F$77:$AD$84,22,FALSE),0))","v":48200},null,null,null,null,"円",9991,null,null,null,"-",1]
["補助者②",null,null,null,null,null,"音楽　花子",null,null,null,null,null,"決定通知記載日",null,null,"全回",null,null,{"$f":"SUM(IFERROR(VLOOKUP(G108,$F$39:$AD$46,22,FALSE),0),IFERROR(VLOOKUP(G108,$F$57:$AD$64,22,FALSE),0),IFERROR(VLOOKUP(G108,$F$77:$AD$84,22,FALSE),0))","v":43000},null,null,null,null,"円",9992,null,null,null,"-",2]
["補助者③",null,null,null,null,null,"演奏　太郎",null,null,null,null,null,"決定通知記載日",null,null,"全回",null,null,43000,null,null,null,null,"円",9993,null,null,null,"-",1]
["補助者④",null,null,null,null,null,"弦楽　花子",null,null,null,null,null,"決定通知記載日",null,null,"第3回",null,null,13040,null,null,null,null,"円","ID未取得",null,null,null,"-"]
["補助者⑤",null,null,null,null,null,"鍵盤　太郎",null,null,null,null,null,"決定通知記載日",null,null,"第3回",null,null,13040,null,null,null,null,"円","ID未取得",null,null,null,"-"]
["補助者⑥",null,null,null,null,null,"　",null,null,null,null,null,null,null,null,null,null,null,0,null,null,null,null,"円",null,null,null,null,"-"]
["補助者⑦",null,null,null,null,null,"　",null,null,null,null,null,null,null,null,null,null,null,0,null,null,null,null,"円",null,null,null,null,"-"]
["補助者⑧",null,null,null,null,null,"　",null,null,null,null,null,null,null,null,null,null,null,{"$f":"SUM(IFERROR(VLOOKUP(G114,$F$39:$AD$46,22,FALSE),0),IFERROR(VLOOKUP(G114,$F$57:$AD$64,22,FALSE),0),IFERROR(VLOOKUP(G114,$F$77:$AD$84,22,FALSE),0))","v":0},null,null,null,null,"円",null,null,null,null,"-"]
["補助者⑨",null,null,null,null,null,"　",null,null,null,null,null,null,null,null,null,null,null,0,null,null,null,null,"円",null,null,null,null,"-"]
["補助者⑩",null,null,null,null,null,"　",null,null,null,null,null,null,null,null,null,null,null,{"$f":"SUM(IFERROR(VLOOKUP(G116,$F$39:$AD$46,22,FALSE),0),IFERROR(VLOOKUP(G116,$F$57:$AD$64,22,FALSE),0),IFERROR(VLOOKUP(G116,$F$77:$AD$84,22,FALSE),0))","v":0},null,null,null,null,"円",null,null,null,null,"-"]
["補助者⑪",null,null,null,null,null,"　",null,null,null,null,null,null,null,null,null,null,null,0,null,null,null,null,"円",null,null,null,null,"-"]
["補助者⑫",null,null,null,null,null,"　",null,null,null,null,null,null,null,null,null,null,null,0,null,null,null,null,"円",null,null,null,null,"-"]
["補助者⑬",null,null,null,null,null,"　",null,null,null,null,null,null,null,null,null,null,null,0,null,null,null,null,"円",null,null,null,null,"-"]
["謝金合計（ａ）",null,null,null,null,null,null,null,null,null,null,null,null,null,null,null,null,null,{"$f":"SUM(S106:W119)","v":267230},null,null,null,null,"円"]
[]
["【②旅費】",null,null,null,null,null,null,null,null,null,null,null,null,"※様式4をもとに記入してください\n※備考欄について、記入が必要な場合のみ記入欄が白になります"]
["下記の額の対象期間",null,null,null,null,null,null,null,null,null,null,null,null,null,null,null,null,"第1回",null,null,null,null,null,"～","第3回"]
["種別",null,null,"氏名　※本名",null,null,null,null,null,"決定額（予算額）",null,null,null,"旅費支払額",null,null,null,"行程\n変更",null,"備考／（予算額からの変更・行程変更有の場合）変更理由"]
["講師",null,null,{"$f":"IF(G106=\"\",\"　\",G106)","v":"芸術　花子"},null,null,null,null,null,{"$f":"IFERROR(IF(D125=\"　\",\"\",VLOOKUP(D125,【様式２・３】実施希望調書!$G$93:$W$106,13,FALSE)),0)","v":37880},null,null,"円",37880,null,null,"円","無"]
["補助者",null,"①","次代　太郎",null,null,null,null,null,{"$f":"IFERROR(IF(D126=\"　\",\"\",VLOOKUP(D126,【様式２・３】実施希望調書!$G$93:$W$106,13,FALSE)),0)","v":3000},null,null,"円",3000,null,null,"円","無"]
[null,null,"②","音楽　花子",null,null,null,null,null,{"$f":"IFERROR(IF(D127=\"　\",\"\",VLOOKUP(D127,【様式２・３】実施希望調書!$G$93:$W$106,13,FALSE)),0)","v":21300},null,null,"円",21300,null,null,"円","無"]
[null,null,"③","演奏　太郎",null,null,null,null,null,{"$f":"IFERROR(IF(D128=\"　\",\"\",VLOOKUP(D128,【様式２・３】実施希望調書!$G$93:$W$106,13,FALSE)),0)","v":1200},null,null,"円",1000,null,null,"円","有",null,"第三回目の実施後、別の仕事に向かったため"]
[null,null,"④","弦楽　花子",null,null,null,null,null,{"$f":"IFERROR(IF(D129=\"　\",\"\",VLOOKUP(D129,【様式２・３】実施希望調書!$G$93:$W$106,13,FALSE)),0)","v":0},null,null,"円",0,null,null,"円","無"]
[null,null,"⑤","鍵盤　太郎",null,null,null,null,null,{"$f":"IFERROR(IF(D130=\"　\",\"\",VLOOKUP(D130,【様式２・３】実施希望調書!$G$93:$W$106,13,FALSE)),0)","v":2210},null,null,"円",2210,null,null,"円","無"]
[null,null,"⑥","　",null,null,null,null,null,{"$f":"IFERROR(IF(D131=\"　\",\"\",VLOOKUP(D131,【様式２・３】実施希望調書!$G$93:$W$106,13,FALSE)),0)","v":""},null,null,"円",null,null,null,"円"]
[null,null,"⑦","　",null,null,null,null,null,{"$f":"IFERROR(IF(D132=\"　\",\"\",VLOOKUP(D132,【様式２・３】実施希望調書!$G$93:$W$106,13,FALSE)),0)","v":""},null,null,"円",null,null,null,"円"]
[null,null,"⑧","　",null,null,null,null,null,{"$f":"IFERROR(IF(D133=\"　\",\"\",VLOOKUP(D133,【様式２・３】実施希望調書!$G$93:$W$106,13,FALSE)),0)","v":""},null,null,"円",null,null,null,"円"]
[null,null,"⑨","　",null,null,null,null,null,{"$f":"IFERROR(IF(D134=\"　\",\"\",VLOOKUP(D134,【様式２・３】実施希望調書!$G$93:$W$106,13,FALSE)),0)","v":""},null,null,"円",null,null,null,"円"]
[null,null,"⑩","　",null,null,null,null,null,{"$f":"IFERROR(IF(D135=\"　\",\"\",VLOOKUP(D135,【様式２・３】実施希望調書!$G$93:$W$106,13,FALSE)),0)","v":""},null,null,"円",null,null,null,"円"]
[null,null,"⑪","　",null,null,null,null,null,{"$f":"IFERROR(IF(D136=\"　\",\"\",VLOOKUP(D136,【様式２・３】実施希望調書!$G$93:$W$106,13,FALSE)),0)","v":""},null,null,"円",null,null,null,"円"]
[null,null,"⑫","　",null,null,null,null,null,{"$f":"IFERROR(IF(D137=\"　\",\"\",VLOOKUP(D137,【様式２・３】実施希望調書!$G$93:$W$106,13,FALSE)),0)","v":""},null,null,"円",null,null,null,"円"]
[null,null,"⑬","　",null,null,null,null,null,{"$f":"IFERROR(IF(D138=\"　\",\"\",VLOOKUP(D138,【様式２・３】実施希望調書!$G$93:$W$106,13,FALSE)),0)","v":""},null,null,"円",null,null,null,"円"]
["旅費合計（ｂ）",null,null,null,null,null,null,null,null,null,null,null,null,{"$f":"SUM(N125:P138)","v":65390},null,null,"円"]
[]
["③【講演等諸雑費】"]
["種別",null,null,null,"項目または業者名",null,null,null,null,"単価",null,null,null,null,"数量",null,"（単位）",null,"発注年月日",null,null,"引取年月日",null,null,"合計"]
[{"$f":"IF(【様式２・３】実施希望調書!A115=\"\",\"\",【様式２・３】実施希望調書!A115)","v":"運搬費"},null,null,null,{"$f":"IF(【様式２・３】実施希望調書!G115=\"\",\"\",【様式２・３】実施希望調書!G115)","v":"○○運搬株式会社"},null,null,null,null,{"$f":"IF(【様式２・３】実施希望調書!M115=\"\",\"\",【様式２・３】実施希望調書!M115)","v":10000},null,null,null,"円",{"$f":"IF(【様式２・３】実施希望調書!S115=\"\",\"\",【様式２・３】実施希望調書!S115)","v":3},null,{"$f":"IF(【様式２・３】実施希望調書!W115=\"\",\"\",【様式２・３】実施希望調書!W115)","v":"回"},null,"決定通知記載日",null,null,"全回",null,null,{"$f":"IF(J143=\"\",\"\",J143*O143)","v":30000},null,null,null,null,"円"]
[{"$f":"IF(【様式２・３】実施希望調書!A116=\"\",\"\",【様式２・３】実施希望調書!A116)","v":"著作権使用料"},null,null,null,{"$f":"IF(【様式２・３】実施希望調書!G116=\"\",\"\",【様式２・３】実施希望調書!G116)","v":"一般社団法人○○○協会"},null,null,null,null,{"$f":"IF(【様式２・３】実施希望調書!M116=\"\",\"\",【様式２・３】実施希望調書!M116)","v":1100},null,null,null,"円",{"$f":"IF(【様式２・３】実施希望調書!S116=\"\",\"\",【様式２・３】実施希望調書!S116)","v":2},null,{"$f":"IF(【様式２・３】実施希望調書!W116=\"\",\"\",【様式２・３】実施希望調書!W116)","v":"回"},null,"決定通知記載日",null,null,"第2回/第3回",null,null,{"$f":"IF(J144=\"\",\"\",J144*O144)","v":2200},null,null,null,null,"円"]
[{"$f":"IF(【様式２・３】実施希望調書!A117=\"\",\"\",【様式２・３】実施希望調書!A117)","v":"レンタル費"},null,null,null,{"$f":"IF(【様式２・３】実施希望調書!G117=\"\",\"\",【様式２・３】実施希望調書!G117)","v":"有限会社○○楽器"},null,null,null,null,{"$f":"IF(【様式２・３】実施希望調書!M117=\"\",\"\",【様式２・３】実施希望調書!M117)","v":1650},null,null,null,"円",{"$f":"IF(【様式２・３】実施希望調書!S117=\"\",\"\",【様式２・３】実施希望調書!S117)","v":10},null,{"$f":"IF(【様式２・３】実施希望調書!W117=\"\",\"\",【様式２・３】実施希望調書!W117)","v":"式"},null,"決定通知記載日",null,null,"第1回",null,null,16500,null,null,null,null,"円"]
[{"$f":"IF(【様式２・３】実施希望調書!A118=\"\",\"\",【様式２・３】実施希望調書!A118)","v":""},null,null,null,{"$f":"IF(【様式２・３】実施希望調書!G118=\"\",\"\",【様式２・３】実施希望調書!G118)","v":""},null,null,null,null,{"$f":"IF(【様式２・３】実施希望調書!M118=\"\",\"\",【様式２・３】実施希望調書!M118)","v":""},null,null,null,"円",{"$f":"IF(【様式２・３】実施希望調書!S118=\"\",\"\",【様式２・３】実施希望調書!S118)","v":""},null,{"$f":"IF(【様式２・３】実施希望調書!W118=\"\",\"\",【様式２・３】実施希望調書!W118)","v":""},null,null,null,null,null,null,null,"",null,null,null,null,"円"]
[{"$f":"IF(【様式２・３】実施希望調書!A119=\"\",\"\",【様式２・３】実施希望調書!A119)","v":""},null,null,null,{"$f":"IF(【様式２・３】実施希望調書!G119=\"\",\"\",【様式２・３】実施希望調書!G119)","v":""},null,null,null,null,{"$f":"IF(【様式２・３】実施希望調書!M119=\"\",\"\",【様式２・３】実施希望調書!M119)","v":""},null,null,null,"円",{"$f":"IF(【様式２・３】実施希望調書!S119=\"\",\"\",【様式２・３】実施希望調書!S119)","v":""},null,{"$f":"IF(【様式２・３】実施希望調書!W119=\"\",\"\",【様式２・３】実施希望調書!W119)","v":""},null,null,null,null,null,null,null,"",null,null,null,null,"円"]
[{"$f":"IF(【様式２・３】実施希望調書!A120=\"\",\"\",【様式２・３】実施希望調書!A120)","v":""},null,null,null,{"$f":"IF(【様式２・３】実施希望調書!G120=\"\",\"\",【様式２・３】実施希望調書!G120)","v":""},null,null,null,null,{"$f":"IF(【様式２・３】実施希望調書!M120=\"\",\"\",【様式２・３】実施希望調書!M120)","v":""},null,null,null,"円",{"$f":"IF(【様式２・３】実施希望調書!S120=\"\",\"\",【様式２・３】実施希望調書!S120)","v":""},null,{"$f":"IF(【様式２・３】実施希望調書!W120=\"\",\"\",【様式２・３】実施希望調書!W120)","v":""},null,null,null,null,null,null,null,"",null,null,null,null,"円"]
[{"$f":"IF(【様式２・３】実施希望調書!A121=\"\",\"\",【様式２・３】実施希望調書!A121)","v":""},null,null,null,{"$f":"IF(【様式２・３】実施希望調書!G121=\"\",\"\",【様式２・３】実施希望調書!G121)","v":""},null,null,null,null,{"$f":"IF(【様式２・３】実施希望調書!M121=\"\",\"\",【様式２・３】実施希望調書!M121)","v":""},null,null,null,"円",{"$f":"IF(【様式２・３】実施希望調書!S121=\"\",\"\",【様式２・３】実施希望調書!S121)","v":""},null,{"$f":"IF(【様式２・３】実施希望調書!W121=\"\",\"\",【様式２・３】実施希望調書!W121)","v":""},null,null,null,null,null,null,null,"",null,null,null,null,"円"]
["講演等諸雑費合計（ｃ）",null,null,null,null,null,null,null,null,null,null,null,null,null,null,null,null,null,null,null,null,null,null,null,{"$f":"SUM(Y143:AC149)","v":48700},null,null,null,null,"円"]

{"sheet":"【様式9・10】集計用補助シート","index":3,"n_rows":4,"n_cols":194,"rows_kept":4,"cut":false,"hidden":true,"merged":[]}
["実施校ID","都道府県・\n政令指定都市","実施校名","学校長名","全校","担当者名","実施会場","TEL","他校との合同\n開催の状況","メール","講師氏名※本名","実施回数","効果・成果1","効果・成果2","効果・成果3","効果・成果4","効果・成果5","効果・成果6","効果・成果7","エピソード対象1(児童生徒）","エピソード対象2（教員）","エピソード対象3（学校全体）","エピソード対象4（その他）","エピソード本文","魅力本文","意見本文","第1回実施日","第1回実施時間","第1回実施時間計","第1回教科の位置づけ①","第1回教科の位置づけ②","第1回参加児童生徒合計","第1回参加単位①","第1回参加単位②","補助者①氏名1回目","補助者①演奏時間1回目","補助者①実技時間1回目","補助者①単労時間1回目","補助者①謝金合計1回目","補助者②氏名1回目","補助者②演奏時間1回目","補助者②実技時間1回目","補助者②単労時間1回目","補助者②謝金合計1回目","補助者③氏名1回目","補助者③演奏時間1回目","補助者③実技時間1回目","補助者③単労時間1回目","補助者③謝金合計1回目","補助者④氏名1回目","補助者④演奏時間1回目","補助者④実技時間1回目","補助者④単労時間1回目","補助者④謝金合計1回目","補助者⑤氏名1回目","補助者⑤演奏時間1回目","補助者⑤実技時間1回目","補助者⑤単労時間1回目","補助者⑤謝金合計1回目","補助者⑥氏名1回目","補助者⑥演奏時間1回目","補助者⑥実技時間1回目","補助者⑥単労時間1回目","補助者⑥謝金合計1回目","補助者⑦氏名1回目","補助者⑦演奏時間1回目","補助者⑦実技時間1回目","補助者⑦単労時間1回目","補助者⑦謝金合計1回目","補助者⑧氏名1回目","補助者⑧演奏時間1回目","補助者⑧実技時間1回目","補助者⑧単労時間1回目","補助者⑧謝金合計1回目","1回目補助者人数","1回目謝金合計","第1回事業内容","第1回児童生徒の反応等","第2回実施日","第2回実施時間","第2回実施時間計","第2回教科の位置づけ①","第2回教科の位置づけ②","第2回参加児童生徒合計","第2回参加単位①","第2回参加単位②","補助者①氏名2回目","補助者①演奏時間2回目","補助者①実技時間2回目","補助者①単労時間2回目","補助者①謝金合計2回目","補助者②氏名2回目","補助者②演奏時間2回目","補助者②実技時間2回目","補助者②単労時間2回目","補助者②謝金合計2回目","補助者③氏名2回目","補助者③演奏時間2回目","補助者③実技時間2回目","補助者③単労時間2回目","補助者③謝金合計2回目","補助者④氏名2回目","補助者④演奏時間2回目","補助者④実技時間2回目","補助者④単労時間2回目","補助者④謝金合計2回目","補助者⑤氏名2回目","補助者⑤演奏時間2回目","補助者⑤実技時間2回目","補助者⑤単労時間2回目","補助者⑤謝金合計2回目","補助者⑥氏名2回目","補助者⑥演奏時間2回目","補助者⑥実技時間2回目","補助者⑥単労時間2回目","補助者⑥謝金合計2回目","補助者⑦氏名2回目","補助者⑦演奏時間2回目","補助者⑦実技時間2回目","補助者⑦単労時間2回目","補助者⑦謝金合計2回目","補助者⑧氏名2回目","補助者⑧演奏時間2回目","補助者⑧実技時間2回目","補助者⑧単労時間2回目","補助者⑧謝金合計2回目","2回目補助者人数","2回目謝金合計","第2回事業内容","第2回児童生徒の反応等","第3回実施日","第3回実施時間","第3回実施時間計","第3回教科の位置づけ①","第3回教科の位置づけ②","第3回参加児童生徒合計","第3回参加単位①","第3回参加単位②","補助者①氏名3回目","補助者①演奏時間3回目","補助者①実技時間3回目","補助者①単労時間3回目","補助者①謝金合計3回目","補助者②氏名3回目","補助者②演奏時間3回目","補助者②実技時間3回目","補助者②単労時間3回目","補助者②謝金合計3回目","補助者③氏名3回目","補助者③演奏時間3回目","補助者③実技時間3回目","補助者③単労時間3回目","補助者③謝金合計3回目","補助者④氏名3回目","補助者④演奏時間3回目","補助者④実技時間3回目","補助者④単労時間3回目","補助者④謝金合計3回目","補助者⑤氏名3回目","補助者⑤演奏時間3回目","補助者⑤実技時間3回目","補助者⑤単労時間3回目","補助者⑤謝金合計3回目","補助者⑥氏名3回目","補助者⑥演奏時間3回目","補助者⑥実技時間3回目","補助者⑥単労時間3回目","補助者⑥謝金合計3回目","補助者⑦氏名3回目","補助者⑦演奏時間3回目","補助者⑦実技時間3回目","補助者⑦単労時間3回目","補助者⑦謝金合計3回目","補助者⑧氏名3回目","補助者⑧演奏時間3回目","補助者⑧実技時間3回目","補助者⑧単労時間3回目","補助者⑧謝金合計3回目","3回目補助者人数","3回目謝金合計","第3回事業内容","第3回児童生徒の反応等","謝金","旅費","諸雑費","決算額計","大項目","中項目","補助者人数（のべ人数）","参加児童生徒（のべ人数）","宮古島","奄美\n・\n小笠原","特別支援・盲・聾学校","備考"]
["=【様式9・10】実施報告書!F5","=【様式9・10】実施報告書!U5","=【様式9・10】実施報告書!F6","=【様式9・10】実施報告書!U6","=【様式9・10】実施報告書!F7","=【様式9・10】実施報告書!U7","=【様式9・10】実施報告書!F8","=【様式9・10】実施報告書!U8","=【様式9・10】実施報告書!I9","=【様式9・10】実施報告書!U9","=【様式9・10】実施報告書!F10","=【様式9・10】実施報告書!U10","=【様式9・10】実施報告書!C13","=【様式9・10】実施報告書!C14","=【様式9・10】実施報告書!C15","=【様式9・10】実施報告書!C16","=【様式9・10】実施報告書!C17","=【様式9・10】実施報告書!C18","=【様式9・10】実施報告書!C19","=【様式9・10】実施報告書!C24","=【様式9・10】実施報告書!K24","=【様式9・10】実施報告書!R24","=【様式9・10】実施報告書!Z24","=【様式9・10】実施報告書!A26","=【様式9・10】実施報告書!A28","=【様式9・10】実施報告書!A30","=【様式9・10】実施報告書!E34","=【様式9・10】実施報告書!S34","=【様式9・10】実施報告書!AA34","=【様式9・10】実施報告書!E35","=【様式9・10】実施報告書!S35","=【様式9・10】実施報告書!G36","=【様式9・10】実施報告書!P36","＝【様式9・10】実施報告書!S37","=【様式9・10】実施報告書!F39","=【様式9・10】実施報告書!N39","=【様式9・10】実施報告書!S39","=【様式9・10】実施報告書!X39","=【様式9・10】実施報告書!AA39","=【様式9・10】実施報告書!F40","=【様式9・10】実施報告書!N40","=【様式9・10】実施報告書!S40","=【様式9・10】実施報告書!X40","=【様式9・10】実施報告書!AA40","=【様式9・10】実施報告書!F41","=【様式9・10】実施報告書!N41","=【様式9・10】実施報告書!S41","=【様式9・10】実施報告書!X41","=【様式9・10】実施報告書!AA41","=【様式9・10】実施報告書!F42","=【様式9・10】実施報告書!N42","=【様式9・10】実施報告書!S42","=【様式9・10】実施報告書!X42","=【様式9・10】実施報告書!AA42","=【様式9・10】実施報告書!F43","=【様式9・10】実施報告書!N43","=【様式9・10】実施報告書!S43","=【様式9・10】実施報告書!X43","=【様式9・10】実施報告書!AA43","=【様式9・10】実施報告書!F44","=【様式9・10】実施報告書!N44","=【様式9・10】実施報告書!S44","=【様式9・10】実施報告書!X44","=【様式9・10】実施報告書!AA44","=【様式9・10】実施報告書!F45","=【様式9・10】実施報告書!N45","=【様式9・10】実施報告書!S45","=【様式9・10】実施報告書!X45","=【様式9・10】実施報告書!AA45","=【様式9・10】実施報告書!F46","=【様式9・10】実施報告書!N46","=【様式9・10】実施報告書!S46","=【様式9・10】実施報告書!X46","=【様式9・10】実施報告書!AA46","=【様式9・10】実施報告書!F47","=【様式9・10】実施報告書!AA47","=【様式9・10】実施報告書!B49","=【様式9・10】実施報告書!B51","=【様式9・10】実施報告書!E52","=【様式9・10】実施報告書!S52","=【様式9・10】実施報告書!AA52","=【様式9・10】実施報告書!E53","=【様式9・10】実施報告書!S53","=【様式9・10】実施報告書!G54","=【様式9・10】実施報告書!P54","=【様式9・10】実施報告書!S55","=【様式9・10】実施報告書!F57","=【様式9・10】実施報告書!N57","=【様式9・10】実施報告書!S57","=【様式9・10】実施報告書!X57","=【様式9・10】実施報告書!AA57","=【様式9・10】実施報告書!F58","=【様式9・10】実施報告書!N58","=【様式9・10】実施報告書!S58","=【様式9・10】実施報告書!X58","=【様式9・10】実施報告書!AA58","=【様式9・10】実施報告書!F59","=【様式9・10】実施報告書!N59","=【様式9・10】実施報告書!S59","=【様式9・10】実施報告書!X59","=【様式9・10】実施報告書!AA59","=【様式9・10】実施報告書!F60","=【様式9・10】実施報告書!N60","=【様式9・10】実施報告書!S60","=【様式9・10】実施報告書!X60","=【様式9・10】実施報告書!AA60","=【様式9・10】実施報告書!F61","=【様式9・10】実施報告書!N61","=【様式9・10】実施報告書!S61","=【様式9・10】実施報告書!X61","=【様式9・10】実施報告書!AA61","=【様式9・10】実施報告書!F62","=【様式9・10】実施報告書!N62","=【様式9・10】実施報告書!S62","=【様式9・10】実施報告書!X62","=【様式9・10】実施報告書!AA62","=【様式9・10】実施報告書!F63","=【様式9・10】実施報告書!N63","=【様式9・10】実施報告書!S63","=【様式9・10】実施報告書!X63","=【様式9・10】実施報告書!AA63","=【様式9・10】実施報告書!F64","=【様式9・10】実施報告書!N64","=【様式9・10】実施報告書!S64","=【様式9・10】実施報告書!X64","=【様式9・10】実施報告書!AA64","=【様式9・10】実施報告書!F65","=【様式9・10】実施報告書!AA65","=【様式9・10】実施報告書!B67","=【様式9・10】実施報告書!B69","=【様式9・10】実施報告書!E72","=【様式9・10】実施報告書!S72","=【様式9・10】実施報告書!AA72","=【様式9・10】実施報告書!E73","=【様式9・10】実施報告書!S73","=【様式9・10】実施報告書!G74","=【様式9・10】実施報告書!P74","=【様式9・10】実施報告書!S75","=【様式9・10】実施報告書!F77","=【様式9・10】実施報告書!N77","=【様式9・10】実施報告書!S77","=【様式9・10】実施報告書!X77","=【様式9・10】実施報告書!AA77","=【様式9・10】実施報告書!F78","=【様式9・10】実施報告書!N78","=【様式9・10】実施報告書!S78","=【様式9・10】実施報告書!X78","=【様式9・10】実施報告書!AA78","=【様式9・10】実施報告書!F79","=【様式9・10】実施報告書!N79","=【様式9・10】実施報告書!S79","=【様式9・10】実施報告書!X79","=【様式9・10】実施報告書!AA79","=【様式9・10】実施報告書!F80","=【様式9・10】実施報告書!N80","=【様式9・10】実施報告書!S80","=【様式9・10】実施報告書!X80","=【様式9・10】実施報告書!AA80","=【様式9・10】実施報告書!F81","=【様式9・10】実施報告書!N81","=【様式9・10】実施報告書!S81","=【様式9・10】実施報告書!X81","=【様式9・10】実施報告書!AA81","=【様式9・10】実施報告書!F82","=【様式9・10】実施報告書!N82","=【様式9・10】実施報告書!S82","=【様式9・10】実施報告書!X82","=【様式9・10】実施報告書!AA82","=【様式9・10】実施報告書!F83","=【様式9・10】実施報告書!N83","=【様式9・10】実施報告書!S83","=【様式9・10】実施報告書!X83","=【様式9・10】実施報告書!AA83","=【様式9・10】実施報告書!F84","=【様式9・10】実施報告書!N84","=【様式9・10】実施報告書!S84","=【様式9・10】実施報告書!X84","=【様式9・10】実施報告書!AA84","=【様式9・10】実施報告書!F85","=【様式9・10】実施報告書!AA85","=【様式9・10】実施報告書!B87","=【様式9・10】実施報告書!B89","=【様式9・10】実施報告書!N99","=【様式9・10】実施報告書!N100","=【様式9・10】実施報告書!N101","=【様式9・10】実施報告書!M102","=【様式２・３】実施希望調書!E13","=【様式２・３】実施希望調書!I13","=【様式9・10】実施報告書!F47+【様式9・10】実施報告書!F65+【様式9・10】実施報告書!F85","=【様式9・10】実施報告書!G36+【様式9・10】実施報告書!G54+【様式9・10】実施報告書!G74"]
[{"$f":"IF(LEN(【様式９・１０】実施報告書!F5)=0,\"\",【様式９・１０】実施報告書!F5)","v":"H9999"},{"$f":"IF(LEN(【様式９・１０】実施報告書!U5)=0,\"\",【様式９・１０】実施報告書!U5)","v":"北海道"},{"$f":"IF(LEN(【様式９・１０】実施報告書!F6)=0,\"\",【様式９・１０】実施報告書!F6)","v":"○○市立文化小学校"},{"$f":"IF(LEN(【様式９・１０】実施報告書!U6)=0,\"\",【様式９・１０】実施報告書!U6)","v":"◇◇　◇◇"},{"$f":"IF(LEN(【様式９・１０】実施報告書!F7)=0,\"\",【様式９・１０】実施報告書!F7)","v":300},{"$f":"IF(LEN(【様式９・１０】実施報告書!U7)=0,\"\",【様式９・１０】実施報告書!U7)","v":"□□　□□"},{"$f":"IF(LEN(【様式９・１０】実施報告書!F8)=0,\"\",【様式９・１０】実施報告書!F8)","v":"実施校の教室・体育館"},{"$f":"IF(LEN(【様式９・１０】実施報告書!U8)=0,\"\",【様式９・１０】実施報告書!U8)","v":"00-0000-0000"},{"$f":"IF(LEN(【様式９・１０】実施報告書!I9)=0,\"\",【様式９・１０】実施報告書!I9)","v":"なし"},{"$f":"IF(LEN(【様式９・１０】実施報告書!U9)=0,\"\",【様式９・１０】実施報告書!U9)","v":"xxx@xxxx.xx.xx"},{"$f":"IF(LEN(【様式９・１０】実施報告書!F10)=0,\"\",【様式９・１０】実施報告書!F10)","v":"芸術　花子"},{"$f":"IF(LEN(【様式９・１０】実施報告書!U10)=0,\"\",【様式９・１０】実施報告書!U10)","v":3},{"$f":"IF(LEN(【様式９・１０】実施報告書!C13)=0,\"\",【様式９・１０】実施報告書!C13)","v":"A"},{"$f":"IF(LEN(【様式９・１０】実施報告書!C14)=0,\"\",【様式９・１０】実施報告書!C14)","v":"A"},{"$f":"IF(LEN(【様式９・１０】実施報告書!C15)=0,\"\",【様式９・１０】実施報告書!C15)","v":"A"},{"$f":"IF(LEN(【様式９・１０】実施報告書!C16)=0,\"\",【様式９・１０】実施報告書!C16)","v":"A"},{"$f":"IF(LEN(【様式９・１０】実施報告書!C17)=0,\"\",【様式９・１０】実施報告書!C17)","v":"A"},{"$f":"IF(LEN(【様式９・１０】実施報告書!C18)=0,\"\",【様式９・１０】実施報告書!C18)","v":"A"},{"$f":"IF(LEN(【様式９・１０】実施報告書!C19)=0,\"\",【様式９・１０】実施報告書!C19)","v":"A"},{"$f":"IF(LEN(【様式９・１０】実施報告書!C24)=0,\"\",【様式９・１０】実施報告書!C24)","v":"○"},{"$f":"IF(LEN(【様式９・１０】実施報告書!K24)=0,\"\",【様式９・１０】実施報告書!K24)","v":"○"},{"$f":"IF(LEN(【様式９・１０】実施報告書!R24)=0,\"\",【様式９・１０】実施報告書!R24)","v":""},{"$f":"IF(LEN(【様式９・１０】実施報告書!Z24)=0,\"\",【様式９・１０】実施報告書!Z24)","v":""},{"$f":"IF(LEN(【様式９・１０】実施報告書!A26)=0,\"\",【様式９・１０】実施報告書!A26)","v":"○○○○○○○○○○○○○○○○○○○○○○○○○○○○○○○○○○○○○○○○○○○○○○○○○○○○○○○○○○○○○○○○○○○○○○○○○○○○○○○○○○○○○○○○○○○○○○○○○○○○○○○○○○○○○○○○○○○○○○○○○○○○○○○○○○○○○○○○○○○○○○○○○○○○○○○○○○○○○○○○○○○○○○○○○○○○"},{"$f":"IF(LEN(【様式９・１０】実施報告書!A28)=0,\"\",【様式９・１０】実施報告書!A28)","v":"○○○○○○○○○○○○○○○○○○○○○○○○○○○○○○○○○○○○○○○○○○○○○○○○○○○○○○○○○○○○○○○○○○○○○○○○○○○○○○○○○○○○○○○○○○○○○○○○○○○○○○○○○○○○○○○○○○○○○○○○○○○○○○○○○○○○○○○○○○○○○○○○○○○○○○○○○○○○○○○○○○○○○○○○○○○○"},{"$f":"IF(LEN(【様式９・１０】実施報告書!A30)=0,\"\",【様式９・１０】実施報告書!A30)","v":"○○○○○○○○○○○○○○○○○○○○○○○○○○○○○○○○○○○○○○○○○○○○○○○○○○○○○○○○○○○○○○○○○○○○○○○○○○○○○○○○○○○○○○○○○○○○○○○○○○○○○○○○○○○○○○○○○○○○○○○○○○○○○○○○○○○○○○○○○○○○○○○○○○○○○○○○○○○○○○○○○○○○○○○○○○○○"},{"$f":"IF(LEN(【様式９・１０】実施報告書!E34)=0,\"\",【様式９・１０】実施報告書!E34)","v":"2022-06-10"},{"$f":"IF(LEN(【様式９・１０】実施報告書!S34)=0,\"\",【様式９・１０】実施報告書!S34)","v":"午前"},{"$f":"IF(LEN(【様式９・１０】実施報告書!AA34)=0,\"\",【様式９・１０】実施報告書!AA34)","v":90},{"$f":"IF(LEN(【様式９・１０】実施報告書!E35)=0,\"\",【様式９・１０】実施報告書!E35)","v":"教科"},{"$f":"IF(LEN(【様式９・１０】実施報告書!S35)=0,\"\",【様式９・１０】実施報告書!S35)","v":"音楽"},{"$f":"IF(LEN(【様式９・１０】実施報告書!G36)=0,\"\",【様式９・１０】実施報告書!G36)","v":100},{"$f":"IF(LEN(【様式９・１０】実施報告書!P36)=0,\"\",【様式９・１０】実施報告書!P36)","v":"学年単位"},{"$f":"IF(LEN(【様式９・１０】実施報告書!S37)=0,\"\",【様式９・１０】実施報告書!S37)","v":"5，6年生"},{"$f":"IF(LEN(【様式９・１０】実施報告書!F39)=0,\"\",【様式９・１０】実施報告書!F39)","v":"次代　太郎"},{"$f":"IF(LEN(【様式９・１０】実施報告書!N39)=0,\"\",【様式９・１０】実施報告書!N39)","v":1},{"$f":"IF(LEN(【様式９・１０】実施報告書!S39)=0,\"\",【様式９・１０】実施報告書!S39)","v":1},{"$f":"IF(LEN(【様式９・１０】実施報告書!X39)=0,\"\",【様式９・１０】実施報告書!X39)","v":"0"},{"$f":"IF(LEN(【様式９・１０】実施報告書!AA39)=0,\"\",【様式９・１０】実施報告書!AA39)","v":11720},{"$f":"IF(LEN(【様式９・１０】実施報告書!F40)=0,\"\",【様式９・１０】実施報告書!F40)","v":"音楽　花子"},{"$f":"IF(LEN(【様式９・１０】実施報告書!N40)=0,\"\",【様式９・１０】実施報告書!N40)","v":1},{"$f":"IF(LEN(【様式９・１０】実施報告書!S40)=0,\"\",【様式９・１０】実施報告書!S40)","v":1},{"$f":"IF(LEN(【様式９・１０】実施報告書!X40)=0,\"\",【様式９・１０】実施報告書!X40)","v":"0"},{"$f":"IF(LEN(【様式９・１０】実施報告書!AA40)=0,\"\",【様式９・１０】実施報告書!AA40)","v":11720},{"$f":"IF(LEN(【様式９・１０】実施報告書!F41)=0,\"\",【様式９・１０】実施報告書!F41)","v":"演奏　太郎"},{"$f":"IF(LEN(【様式９・１０】実施報告書!N41)=0,\"\",【様式９・１０】実施報告書!N41)","v":1},{"$f":"IF(LEN(【様式９・１０】実施報告書!S41)=0,\"\",【様式９・１０】実施報告書!S41)","v":1},{"$f":"IF(LEN(【様式９・１０】実施報告書!X41)=0,\"\",【様式９・１０】実施報告書!X41)","v":"0"},{"$f":"IF(LEN(【様式９・１０】実施報告書!AA41)=0,\"\",【様式９・１０】実施報告書!AA41)","v":11720},{"$f":"IF(LEN(【様式９・１０】実施報告書!F42)=0,\"\",【様式９・１０】実施報告書!F42)","v":""},{"$f":"IF(LEN(【様式９・１０】実施報告書!N42)=0,\"\",【様式９・１０】実施報告書!N42)","v":"0"},{"$f":"IF(LEN(【様式９・１０】実施報告書!S42)=0,\"\",【様式９・１０】実施報告書!S42)","v":"0"},{"$f":"IF(LEN(【様式９・１０】実施報告書!X42)=0,\"\",【様式９・１０】実施報告書!X42)","v":"0"},{"$f":"IF(LEN(【様式９・１０】実施報告書!AA42)=0,\"\",【様式９・１０】実施報告書!AA42)","v":0},{"$f":"IF(LEN(【様式９・１０】実施報告書!F43)=0,\"\",【様式９・１０】実施報告書!F43)","v":""},{"$f":"IF(LEN(【様式９・１０】実施報告書!N43)=0,\"\",【様式９・１０】実施報告書!N43)","v":"0"},{"$f":"IF(LEN(【様式９・１０】実施報告書!S43)=0,\"\",【様式９・１０】実施報告書!S43)","v":"0"},{"$f":"IF(LEN(【様式９・１０】実施報告書!X43)=0,\"\",【様式９・１０】実施報告書!X43)","v":"0"},{"$f":"IF(LEN(【様式９・１０】実施報告書!AA43)=0,\"\",【様式９・１０】実施報告書!AA43)","v":0},{"$f":"IF(LEN(【様式９・１０】実施報告書!F44)=0,\"\",【様式９・１０】実施報告書!F44)","v":""},{"$f":"IF(LEN(【様式９・１０】実施報告書!N44)=0,\"\",【様式９・１０】実施報告書!N44)","v":"0"},{"$f":"IF(LEN(【様式９・１０】実施報告書!S44)=0,\"\",【様式９・１０】実施報告書!S44)","v":"0"},{"$f":"IF(LEN(【様式９・１０】実施報告書!X44)=0,\"\",【様式９・１０】実施報告書!X44)","v":"0"},{"$f":"IF(LEN(【様式９・１０】実施報告書!AA44)=0,\"\",【様式９・１０】実施報告書!AA44)","v":0},{"$f":"IF(LEN(【様式９・１０】実施報告書!F45)=0,\"\",【様式９・１０】実施報告書!F45)","v":""},{"$f":"IF(LEN(【様式９・１０】実施報告書!N45)=0,\"\",【様式９・１０】実施報告書!N45)","v":"0"},{"$f":"IF(LEN(【様式９・１０】実施報告書!S45)=0,\"\",【様式９・１０】実施報告書!S45)","v":"0"},{"$f":"IF(LEN(【様式９・１０】実施報告書!X45)=0,\"\",【様式９・１０】実施報告書!X45)","v":"0"},{"$f":"IF(LEN(【様式９・１０】実施報告書!AA45)=0,\"\",【様式９・１０】実施報告書!AA45)","v":0},{"$f":"IF(LEN(【様式９・１０】実施報告書!F46)=0,\"\",【様式９・１０】実施報告書!F46)","v":""},{"$f":"IF(LEN(【様式９・１０】実施報告書!N46)=0,\"\",【様式９・１０】実施報告書!N46)","v":"0"},{"$f":"IF(LEN(【様式９・１０】実施報告書!S46)=0,\"\",【様式９・１０】実施報告書!S46)","v":"0"},{"$f":"IF(LEN(【様式９・１０】実施報告書!X46)=0,\"\",【様式９・１０】実施報告書!X46)","v":"0"},{"$f":"IF(LEN(【様式９・１０】実施報告書!AA46)=0,\"\",【様式９・１０】実施報告書!AA46)","v":0},{"$f":"IF(LEN(【様式９・１０】実施報告書!F47)=0,\"\",【様式９・１０】実施報告書!F47)","v":3},{"$f":"IF(LEN(【様式９・１０】実施報告書!AA47)=0,\"\",【様式９・１０】実施報告書!AA47)","v":35160},{"$f":"IF(LEN(【様式９・１０】実施報告書!B49)=0,\"\",【様式９・１０】実施報告書!B49)","v":"○○○○○○○○○○○○○○○○○○○○○○○○○○○○○○○○○○○○○○○○○○○○○○○○○○○○○○○○○○○○○○○○○○○○○○○○○○○○○○○○○○○○○○○○○○○○○○○○○○○○○○○○○○○○○○○○○○○○○○○○○○○○○○○○○○○○○○○○○○○○○○○○○○○○○○○○○○○○○○○○○○○○○○○○○○○○"},{"$f":"IF(LEN(【様式９・１０】実施報告書!B51)=0,\"\",【様式９・１０】実施報告書!B51)","v":"○○○○○○○○○○○○○○○○○○○○○○○○○○○○○○○○○○○○○○○○○○○○○○○○○○○○○○○○○○○○○○○○○○○○○○○○○○○○○○○○○○○○○○○○○○○○○○○○○○○○○○○○○○○○○○○○○○○○○○○○○○○○○○○○○○○○○○○○○○○○○○○○○○○○○○○○○○○○○○○○○○○○○○○○○○○○"},{"$f":"IF(LEN(【様式９・１０】実施報告書!E52)=0,\"\",【様式９・１０】実施報告書!E52)","v":"2022-06-17"},{"$f":"IF(LEN(【様式９・１０】実施報告書!S52)=0,\"\",【様式９・１０】実施報告書!S52)","v":"午後"},{"$f":"IF(LEN(【様式９・１０】実施報告書!AA52)=0,\"\",【様式９・１０】実施報告書!AA52)","v":150},{"$f":"IF(LEN(【様式９・１０】実施報告書!E53)=0,\"\",【様式９・１０】実施報告書!E53)","v":"総合的な学習の時間"},{"$f":"IF(LEN(【様式９・１０】実施報告書!S53)=0,\"\",【様式９・１０】実施報告書!S53)","v":""},{"$f":"IF(LEN(【様式９・１０】実施報告書!G54)=0,\"\",【様式９・１０】実施報告書!G54)","v":100},{"$f":"IF(LEN(【様式９・１０】実施報告書!P54)=0,\"\",【様式９・１０】実施報告書!P54)","v":"学年単位"},{"$f":"IF(LEN(【様式９・１０】実施報告書!S55)=0,\"\",【様式９・１０】実施報告書!S55)","v":"5，6年生"},{"$f":"IF(LEN(【様式９・１０】実施報告書!F57)=0,\"\",【様式９・１０】実施報告書!F57)","v":"次代　太郎"},{"$f":"IF(LEN(【様式９・１０】実施報告書!N57)=0,\"\",【様式９・１０】実施報告書!N57)","v":2},{"$f":"IF(LEN(【様式９・１０】実施報告書!S57)=0,\"\",【様式９・１０】実施報告書!S57)","v":1},{"$f":"IF(LEN(【様式９・１０】実施報告書!X57)=0,\"\",【様式９・１０】実施報告書!X57)","v":"0"},{"$f":"IF(LEN(【様式９・１０】実施報告書!AA57)=0,\"\",【様式９・１０】実施報告書!AA57)","v":18240},{"$f":"IF(LEN(【様式９・１０】実施報告書!F58)=0,\"\",【様式９・１０】実施報告書!F58)","v":"音楽　花子"},{"$f":"IF(LEN(【様式９・１０】実施報告書!N58)=0,\"\",【様式９・１０】実施報告書!N58)","v":2},{"$f":"IF(LEN(【様式９・１０】実施報告書!S58)=0,\"\",【様式９・１０】実施報告書!S58)","v":1},{"$f":"IF(LEN(【様式９・１０】実施報告書!X58)=0,\"\",【様式９・１０】実施報告書!X58)","v":"0"},{"$f":"IF(LEN(【様式９・１０】実施報告書!AA58)=0,\"\",【様式９・１０】実施報告書!AA58)","v":18240},{"$f":"IF(LEN(【様式９・１０】実施報告書!F59)=0,\"\",【様式９・１０】実施報告書!F59)","v":"演奏　太郎"},{"$f":"IF(LEN(【様式９・１０】実施報告書!N59)=0,\"\",【様式９・１０】実施報告書!N59)","v":2},{"$f":"IF(LEN(【様式９・１０】実施報告書!S59)=0,\"\",【様式９・１０】実施報告書!S59)","v":1},{"$f":"IF(LEN(【様式９・１０】実施報告書!X59)=0,\"\",【様式９・１０】実施報告書!X59)","v":"0"},{"$f":"IF(LEN(【様式９・１０】実施報告書!AA59)=0,\"\",【様式９・１０】実施報告書!AA59)","v":18240},{"$f":"IF(LEN(【様式９・１０】実施報告書!F60)=0,\"\",【様式９・１０】実施報告書!F60)","v":""},{"$f":"IF(LEN(【様式９・１０】実施報告書!N60)=0,\"\",【様式９・１０】実施報告書!N60)","v":"0"},{"$f":"IF(LEN(【様式９・１０】実施報告書!S60)=0,\"\",【様式９・１０】実施報告書!S60)","v":"0"},{"$f":"IF(LEN(【様式９・１０】実施報告書!X60)=0,\"\",【様式９・１０】実施報告書!X60)","v":"0"},{"$f":"IF(LEN(【様式９・１０】実施報告書!AA60)=0,\"\",【様式９・１０】実施報告書!AA60)","v":0},{"$f":"IF(LEN(【様式９・１０】実施報告書!F61)=0,\"\",【様式９・１０】実施報告書!F61)","v":""},{"$f":"IF(LEN(【様式９・１０】実施報告書!N61)=0,\"\",【様式９・１０】実施報告書!N61)","v":"0"},{"$f":"IF(LEN(【様式９・１０】実施報告書!S61)=0,\"\",【様式９・１０】実施報告書!S61)","v":"0"},{"$f":"IF(LEN(【様式９・１０】実施報告書!X61)=0,\"\",【様式９・１０】実施報告書!X61)","v":"0"},{"$f":"IF(LEN(【様式９・１０】実施報告書!AA61)=0,\"\",【様式９・１０】実施報告書!AA61)","v":0},{"$f":"IF(LEN(【様式９・１０】実施報告書!F62)=0,\"\",【様式９・１０】実施報告書!F62)","v":""},{"$f":"IF(LEN(【様式９・１０】実施報告書!N62)=0,\"\",【様式９・１０】実施報告書!N62)","v":"0"},{"$f":"IF(LEN(【様式９・１０】実施報告書!S62)=0,\"\",【様式９・１０】実施報告書!S62)","v":"0"},{"$f":"IF(LEN(【様式９・１０】実施報告書!X62)=0,\"\",【様式９・１０】実施報告書!X62)","v":"0"},{"$f":"IF(LEN(【様式９・１０】実施報告書!AA62)=0,\"\",【様式９・１０】実施報告書!AA62)","v":0},{"$f":"IF(LEN(【様式９・１０】実施報告書!F63)=0,\"\",【様式９・１０】実施報告書!F63)","v":""},{"$f":"IF(LEN(【様式９・１０】実施報告書!N63)=0,\"\",【様式９・１０】実施報告書!N63)","v":"0"},{"$f":"IF(LEN(【様式９・１０】実施報告書!S63)=0,\"\",【様式９・１０】実施報告書!S63)","v":"0"},{"$f":"IF(LEN(【様式９・１０】実施報告書!X63)=0,\"\",【様式９・１０】実施報告書!X63)","v":"0"},{"$f":"IF(LEN(【様式９・１０】実施報告書!AA63)=0,\"\",【様式９・１０】実施報告書!AA63)","v":0},{"$f":"IF(LEN(【様式９・１０】実施報告書!F64)=0,\"\",【様式９・１０】実施報告書!F64)","v":""},{"$f":"IF(LEN(【様式９・１０】実施報告書!N64)=0,\"\",【様式９・１０】実施報告書!N64)","v":"0"},{"$f":"IF(LEN(【様式９・１０】実施報告書!S64)=0,\"\",【様式９・１０】実施報告書!S64)","v":"0"},{"$f":"IF(LEN(【様式９・１０】実施報告書!X64)=0,\"\",【様式９・１０】実施報告書!X64)","v":"0"},{"$f":"IF(LEN(【様式９・１０】実施報告書!AA64)=0,\"\",【様式９・１０】実施報告書!AA64)","v":0},{"$f":"IF(LEN(【様式９・１０】実施報告書!F65)=0,\"\",【様式９・１０】実施報告書!F65)","v":3},{"$f":"IF(LEN(【様式９・１０】実施報告書!AA65)=0,\"\",【様式９・１０】実施報告書!AA65)","v":54720},{"$f":"IF(LEN(【様式９・１０】実施報告書!B67)=0,\"\",【様式９・１０】実施報告書!B67)","v":"○○○○○○○○○○○○○○○○○○○○○○○○○○○○○○○○○○○○○○○○○○○○○○○○○○○○○○○○○○○○○○○○○○○○○○○○○○○○○○○○○○○○○○○○○○○○○○○○○○○○○○○○○○○○○○○○○○○○○○○○○○○○○○○○○○○○○○○○○○○○○○○○○○○○○○○○○○○○○○○○○○○○○○○○○○○○"},{"$f":"IF(LEN(【様式９・１０】実施報告書!B69)=0,\"\",【様式９・１０】実施報告書!B69)","v":"○○○○○○○○○○○○○○○○○○○○○○○○○○○○○○○○○○○○○○○○○○○○○○○○○○○○○○○○○○○○○○○○○○○○○○○○○○○○○○○○○○○○○○○○○○○○○○○○○○○○○○○○○○○○○○○○○○○○○○○○○○○○○○○○○○○○○○○○○○○○○○○○○○○○○○○○○○○○○○○○○○○○○○○○○○○○"},{"$f":"IF(LEN(【様式９・１０】実施報告書!E72)=0,\"\",【様式９・１０】実施報告書!E72)","v":"2022-06-23"},{"$f":"IF(LEN(【様式９・１０】実施報告書!S72)=0,\"\",【様式９・１０】実施報告書!S72)","v":"午前と午後"},{"$f":"IF(LEN(【様式９・１０】実施報告書!AA72)=0,\"\",【様式９・１０】実施報告書!AA72)","v":150},{"$f":"IF(LEN(【様式９・１０】実施報告書!E73)=0,\"\",【様式９・１０】実施報告書!E73)","v":"特別活動"},{"$f":"IF(LEN(【様式９・１０】実施報告書!S73)=0,\"\",【様式９・１０】実施報告書!S73)","v":"文化的行事"},{"$f":"IF(LEN(【様式９・１０】実施報告書!G74)=0,\"\",【様式９・１０】実施報告書!G74)","v":300},{"$f":"IF(LEN(【様式９・１０】実施報告書!P74)=0,\"\",【様式９・１０】実施報告書!P74)","v":"全校児童/生徒"},{"$f":"IF(LEN(【様式９・１０】実施報告書!S75)=0,\"\",【様式９・１０】実施報告書!S75)","v":""},{"$f":"IF(LEN(【様式９・１０】実施報告書!F77)=0,\"\",【様式９・１０】実施報告書!F77)","v":"次代　太郎"},{"$f":"IF(LEN(【様式９・１０】実施報告書!N77)=0,\"\",【様式９・１０】実施報告書!N77)","v":2},{"$f":"IF(LEN(【様式９・１０】実施報告書!S77)=0,\"\",【様式９・１０】実施報告書!S77)","v":1},{"$f":"IF(LEN(【様式９・１０】実施報告書!X77)=0,\"\",【様式９・１０】実施報告書!X77)","v":"0"},{"$f":"IF(LEN(【様式９・１０】実施報告書!AA77)=0,\"\",【様式９・１０】実施報告書!AA77)","v":18240},{"$f":"IF(LEN(【様式９・１０】実施報告書!F78)=0,\"\",【様式９・１０】実施報告書!F78)","v":"音楽　花子"},{"$f":"IF(LEN(【様式９・１０】実施報告書!N78)=0,\"\",【様式９・１０】実施報告書!N78)","v":2},{"$f":"IF(LEN(【様式９・１０】実施報告書!S78)=0,\"\",【様式９・１０】実施報告書!S78)","v":"0"},{"$f":"IF(LEN(【様式９・１０】実施報告書!X78)=0,\"\",【様式９・１０】実施報告書!X78)","v":"0"},{"$f":"IF(LEN(【様式９・１０】実施報告書!AA78)=0,\"\",【様式９・１０】実施報告書!AA78)","v":13040},{"$f":"IF(LEN(【様式９・１０】実施報告書!F79)=0,\"\",【様式９・１０】実施報告書!F79)","v":"演奏　太郎"},{"$f":"IF(LEN(【様式９・１０】実施報告書!N79)=0,\"\",【様式９・１０】実施報告書!N79)","v":2},{"$f":"IF(LEN(【様式９・１０】実施報告書!S79)=0,\"\",【様式９・１０】実施報告書!S79)","v":"0"},{"$f":"IF(LEN(【様式９・１０】実施報告書!X79)=0,\"\",【様式９・１０】実施報告書!X79)","v":"0"},{"$f":"IF(LEN(【様式９・１０】実施報告書!AA79)=0,\"\",【様式９・１０】実施報告書!AA79)","v":13040},{"$f":"IF(LEN(【様式９・１０】実施報告書!F80)=0,\"\",【様式９・１０】実施報告書!F80)","v":"弦楽　花子"},{"$f":"IF(LEN(【様式９・１０】実施報告書!N80)=0,\"\",【様式９・１０】実施報告書!N80)","v":2},{"$f":"IF(LEN(【様式９・１０】実施報告書!S80)=0,\"\",【様式９・１０】実施報告書!S80)","v":"0"},{"$f":"IF(LEN(【様式９・１０】実施報告書!X80)=0,\"\",【様式９・１０】実施報告書!X80)","v":"0"},{"$f":"IF(LEN(【様式９・１０】実施報告書!AA80)=0,\"\",【様式９・１０】実施報告書!AA80)","v":13040},{"$f":"IF(LEN(【様式９・１０】実施報告書!F81)=0,\"\",【様式９・１０】実施報告書!F81)","v":"鍵盤　太郎"},{"$f":"IF(LEN(【様式９・１０】実施報告書!N81)=0,\"\",【様式９・１０】実施報告書!N81)","v":2},{"$f":"IF(LEN(【様式９・１０】実施報告書!S81)=0,\"\",【様式９・１０】実施報告書!S81)","v":"0"},{"$f":"IF(LEN(【様式９・１０】実施報告書!X81)=0,\"\",【様式９・１０】実施報告書!X81)","v":"0"},{"$f":"IF(LEN(【様式９・１０】実施報告書!AA81)=0,\"\",【様式９・１０】実施報告書!AA81)","v":13040},{"$f":"IF(LEN(【様式９・１０】実施報告書!F82)=0,\"\",【様式９・１０】実施報告書!F82)","v":""},{"$f":"IF(LEN(【様式９・１０】実施報告書!N82)=0,\"\",【様式９・１０】実施報告書!N82)","v":"0"},{"$f":"IF(LEN(【様式９・１０】実施報告書!S82)=0,\"\",【様式９・１０】実施報告書!S82)","v":"0"},{"$f":"IF(LEN(【様式９・１０】実施報告書!X82)=0,\"\",【様式９・１０】実施報告書!X82)","v":"0"},{"$f":"IF(LEN(【様式９・１０】実施報告書!AA82)=0,\"\",【様式９・１０】実施報告書!AA82)","v":0},{"$f":"IF(LEN(【様式９・１０】実施報告書!F83)=0,\"\",【様式９・１０】実施報告書!F83)","v":""},{"$f":"IF(LEN(【様式９・１０】実施報告書!N83)=0,\"\",【様式９・１０】実施報告書!N83)","v":"0"},{"$f":"IF(LEN(【様式９・１０】実施報告書!S83)=0,\"\",【様式９・１０】実施報告書!S83)","v":"0"},{"$f":"IF(LEN(【様式９・１０】実施報告書!X83)=0,\"\",【様式９・１０】実施報告書!X83)","v":"0"},{"$f":"IF(LEN(【様式９・１０】実施報告書!AA83)=0,\"\",【様式９・１０】実施報告書!AA83)","v":0},{"$f":"IF(LEN(【様式９・１０】実施報告書!F84)=0,\"\",【様式９・１０】実施報告書!F84)","v":""},{"$f":"IF(LEN(【様式９・１０】実施報告書!N84)=0,\"\",【様式９・１０】実施報告書!N84)","v":"0"},{"$f":"IF(LEN(【様式９・１０】実施報告書!S84)=0,\"\",【様式９・１０】実施報告書!S84)","v":"0"},{"$f":"IF(LEN(【様式９・１０】実施報告書!X84)=0,\"\",【様式９・１０】実施報告書!X84)","v":"0"},{"$f":"IF(LEN(【様式９・１０】実施報告書!AA84)=0,\"\",【様式９・１０】実施報告書!AA84)","v":0},{"$f":"IF(LEN(【様式９・１０】実施報告書!F85)=0,\"\",【様式９・１０】実施報告書!F85)","v":5},{"$f":"IF(LEN(【様式９・１０】実施報告書!AA85)=0,\"\",【様式９・１０】実施報告書!AA85)","v":70400},{"$f":"IF(LEN(【様式９・１０】実施報告書!B87)=0,\"\",【様式９・１０】実施報告書!B87)","v":"○○○○○○○○○○○○○○○○○○○○○○○○○○○○○○○○○○○○○○○○○○○○○○○○○○○○○○○○○○○○○○○○○○○○○○○○○○○○○○○○○○○○○○○○○○○○○○○○○○○○○○○○○○○○○○○○○○○○○○○○○○○○○○○○○○○○○○○○○○○○○○○○○○○○○○○○○○○○○○○○○○○○○○○○○○○○"},{"$f":"IF(LEN(【様式９・１０】実施報告書!B89)=0,\"\",【様式９・１０】実施報告書!B89)","v":"○○○○○○○○○○○○○○○○○○○○○○○○○○○○○○○○○○○○○○○○○○○○○○○○○○○○○○○○○○○○○○○○○○○○○○○○○○○○○○○○○○○○○○○○○○○○○○○○○○○○○○○○○○○○○○○○○○○○○○○○○○○○○○○○○○○○○○○○○○○○○○○○○○○○○○○○○○○○○○○○○○○○○○○○○○○○"},{"$f":"IF(LEN(【様式９・１０】実施報告書!N99)=0,\"\",【様式９・１０】実施報告書!N99)","v":267230},{"$f":"IF(LEN(【様式９・１０】実施報告書!N100)=0,\"\",【様式９・１０】実施報告書!N100)","v":65390},{"$f":"IF(LEN(【様式９・１０】実施報告書!N101)=0,\"\",【様式９・１０】実施報告書!N101)","v":48700},{"$f":"IF(LEN(【様式９・１０】実施報告書!M102)=0,\"\",【様式９・１０】実施報告書!M102)","v":381320},{"$f":"IF(LEN(【様式２・３】実施希望調書!E13)=0,\"\",【様式２・３】実施希望調書!E13)","v":"音楽"},{"$f":"IF(LEN(【様式２・３】実施希望調書!I13)=0,\"\",【様式２・３】実施希望調書!I13)","v":"C　弦楽器"},{"$f":"IF(LEN(【様式９・１０】実施報告書!F47+【様式９・１０】実施報告書!F65+【様式９・１０】実施報告書!F85)=0,\"\",【様式９・１０】実施報告書!F47+【様式９・１０】実施報告書!F65+【様式９・１０】実施報告書!F85)","v":11},{"$f":"IF(LEN(【様式９・１０】実施報告書!G36+【様式９・１０】実施報告書!G54+【様式９・１０】実施報告書!G74)=0,\"\",【様式９・１０】実施報告書!G36+【様式９・１０】実施報告書!G54+【様式９・１０】実施報告書!G74)","v":500}]
[{"$f":"【様式９・１０】実施報告書!F5","v":"H9999"},{"$f":"【様式９・１０】実施報告書!U5","v":"北海道"},{"$f":"【様式９・１０】実施報告書!F6","v":"○○市立文化小学校"},{"$f":"【様式９・１０】実施報告書!U6","v":"◇◇　◇◇"},{"$f":"【様式９・１０】実施報告書!F7","v":300},{"$f":"【様式９・１０】実施報告書!U7","v":"□□　□□"},{"$f":"【様式９・１０】実施報告書!F8","v":"実施校の教室・体育館"},{"$f":"【様式９・１０】実施報告書!U8","v":"00-0000-0000"},{"$f":"【様式９・１０】実施報告書!I9","v":"なし"},{"$f":"【様式９・１０】実施報告書!U9","v":"xxx@xxxx.xx.xx"},{"$f":"【様式９・１０】実施報告書!F10","v":"芸術　花子"},{"$f":"【様式９・１０】実施報告書!U10","v":3},{"$f":"【様式９・１０】実施報告書!C13","v":"A"},{"$f":"【様式９・１０】実施報告書!C14","v":"A"},{"$f":"【様式９・１０】実施報告書!C15","v":"A"},{"$f":"【様式９・１０】実施報告書!C16","v":"A"},{"$f":"【様式９・１０】実施報告書!C17","v":"A"},{"$f":"【様式９・１０】実施報告書!C18","v":"A"},{"$f":"【様式９・１０】実施報告書!C19","v":"A"},{"$f":"【様式９・１０】実施報告書!C24","v":"○"},{"$f":"【様式９・１０】実施報告書!K24","v":"○"},{"$f":"【様式９・１０】実施報告書!R24","v":0},{"$f":"【様式９・１０】実施報告書!Z24","v":0},{"$f":"【様式９・１０】実施報告書!A26","v":"○○○○○○○○○○○○○○○○○○○○○○○○○○○○○○○○○○○○○○○○○○○○○○○○○○○○○○○○○○○○○○○○○○○○○○○○○○○○○○○○○○○○○○○○○○○○○○○○○○○○○○○○○○○○○○○○○○○○○○○○○○○○○○○○○○○○○○○○○○○○○○○○○○○○○○○○○○○○○○○○○○○○○○○○○○○○"},{"$f":"【様式９・１０】実施報告書!A28","v":"○○○○○○○○○○○○○○○○○○○○○○○○○○○○○○○○○○○○○○○○○○○○○○○○○○○○○○○○○○○○○○○○○○○○○○○○○○○○○○○○○○○○○○○○○○○○○○○○○○○○○○○○○○○○○○○○○○○○○○○○○○○○○○○○○○○○○○○○○○○○○○○○○○○○○○○○○○○○○○○○○○○○○○○○○○○○"},{"$f":"【様式９・１０】実施報告書!A30","v":"○○○○○○○○○○○○○○○○○○○○○○○○○○○○○○○○○○○○○○○○○○○○○○○○○○○○○○○○○○○○○○○○○○○○○○○○○○○○○○○○○○○○○○○○○○○○○○○○○○○○○○○○○○○○○○○○○○○○○○○○○○○○○○○○○○○○○○○○○○○○○○○○○○○○○○○○○○○○○○○○○○○○○○○○○○○○"},{"$f":"【様式９・１０】実施報告書!E34","v":"2022-06-10"},{"$f":"【様式９・１０】実施報告書!S34","v":"午前"},{"$f":"【様式９・１０】実施報告書!AA34","v":90},{"$f":"【様式９・１０】実施報告書!E35","v":"教科"},{"$f":"【様式９・１０】実施報告書!S35","v":"音楽"},{"$f":"【様式９・１０】実施報告書!G36","v":100},{"$f":"【様式９・１０】実施報告書!P36","v":"学年単位"},{"$f":"【様式９・１０】実施報告書!S37","v":"5，6年生"},{"$f":"【様式９・１０】実施報告書!F39","v":"次代　太郎"},{"$f":"【様式９・１０】実施報告書!N39","v":1},{"$f":"【様式９・１０】実施報告書!S39","v":1},{"$f":"【様式９・１０】実施報告書!X39","v":"0"},{"$f":"【様式９・１０】実施報告書!AA39","v":11720},{"$f":"【様式９・１０】実施報告書!F40","v":"音楽　花子"},{"$f":"【様式９・１０】実施報告書!N40","v":1},{"$f":"【様式９・１０】実施報告書!S40","v":1},{"$f":"【様式９・１０】実施報告書!X40","v":"0"},{"$f":"【様式９・１０】実施報告書!AA40","v":11720},{"$f":"【様式９・１０】実施報告書!F41","v":"演奏　太郎"},{"$f":"【様式９・１０】実施報告書!N41","v":1},{"$f":"【様式９・１０】実施報告書!S41","v":1},{"$f":"【様式９・１０】実施報告書!X41","v":"0"},{"$f":"【様式９・１０】実施報告書!AA41","v":11720},{"$f":"【様式９・１０】実施報告書!F42","v":""},{"$f":"【様式９・１０】実施報告書!N42","v":"0"},{"$f":"【様式９・１０】実施報告書!S42","v":"0"},{"$f":"【様式９・１０】実施報告書!X42","v":"0"},{"$f":"【様式９・１０】実施報告書!AA42","v":0},{"$f":"【様式９・１０】実施報告書!F43","v":""},{"$f":"【様式９・１０】実施報告書!N43","v":"0"},{"$f":"【様式９・１０】実施報告書!S43","v":"0"},{"$f":"【様式９・１０】実施報告書!X43","v":"0"},{"$f":"【様式９・１０】実施報告書!AA43","v":0},{"$f":"【様式９・１０】実施報告書!F44","v":""},{"$f":"【様式９・１０】実施報告書!N44","v":"0"},{"$f":"【様式９・１０】実施報告書!S44","v":"0"},{"$f":"【様式９・１０】実施報告書!X44","v":"0"},{"$f":"【様式９・１０】実施報告書!AA44","v":0},{"$f":"【様式９・１０】実施報告書!F45","v":""},{"$f":"【様式９・１０】実施報告書!N45","v":"0"},{"$f":"【様式９・１０】実施報告書!S45","v":"0"},{"$f":"【様式９・１０】実施報告書!X45","v":"0"},{"$f":"【様式９・１０】実施報告書!AA45","v":0},{"$f":"【様式９・１０】実施報告書!F46","v":""},{"$f":"【様式９・１０】実施報告書!N46","v":"0"},{"$f":"【様式９・１０】実施報告書!S46","v":"0"},{"$f":"【様式９・１０】実施報告書!X46","v":"0"},{"$f":"【様式９・１０】実施報告書!AA46","v":0},{"$f":"【様式９・１０】実施報告書!F47","v":3},{"$f":"【様式９・１０】実施報告書!AA47","v":35160},{"$f":"【様式９・１０】実施報告書!B49","v":"○○○○○○○○○○○○○○○○○○○○○○○○○○○○○○○○○○○○○○○○○○○○○○○○○○○○○○○○○○○○○○○○○○○○○○○○○○○○○○○○○○○○○○○○○○○○○○○○○○○○○○○○○○○○○○○○○○○○○○○○○○○○○○○○○○○○○○○○○○○○○○○○○○○○○○○○○○○○○○○○○○○○○○○○○○○○"},{"$f":"【様式９・１０】実施報告書!B51","v":"○○○○○○○○○○○○○○○○○○○○○○○○○○○○○○○○○○○○○○○○○○○○○○○○○○○○○○○○○○○○○○○○○○○○○○○○○○○○○○○○○○○○○○○○○○○○○○○○○○○○○○○○○○○○○○○○○○○○○○○○○○○○○○○○○○○○○○○○○○○○○○○○○○○○○○○○○○○○○○○○○○○○○○○○○○○○"},{"$f":"【様式９・１０】実施報告書!E52","v":"2022-06-17"},{"$f":"【様式９・１０】実施報告書!S52","v":"午後"},{"$f":"【様式９・１０】実施報告書!AA52","v":150},{"$f":"【様式９・１０】実施報告書!E53","v":"総合的な学習の時間"},{"$f":"【様式９・１０】実施報告書!S53","v":""},{"$f":"【様式９・１０】実施報告書!G54","v":100},{"$f":"【様式９・１０】実施報告書!P54","v":"学年単位"},{"$f":"【様式９・１０】実施報告書!S55","v":"5，6年生"},{"$f":"【様式９・１０】実施報告書!F57","v":"次代　太郎"},{"$f":"【様式９・１０】実施報告書!N57","v":2},{"$f":"【様式９・１０】実施報告書!S57","v":1},{"$f":"【様式９・１０】実施報告書!X57","v":"0"},{"$f":"【様式９・１０】実施報告書!AA57","v":18240},{"$f":"【様式９・１０】実施報告書!F58","v":"音楽　花子"},{"$f":"【様式９・１０】実施報告書!N58","v":2},{"$f":"【様式９・１０】実施報告書!S58","v":1},{"$f":"【様式９・１０】実施報告書!X58","v":"0"},{"$f":"【様式９・１０】実施報告書!AA58","v":18240},{"$f":"【様式９・１０】実施報告書!F59","v":"演奏　太郎"},{"$f":"【様式９・１０】実施報告書!N59","v":2},{"$f":"【様式９・１０】実施報告書!S59","v":1},{"$f":"【様式９・１０】実施報告書!X59","v":"0"},{"$f":"【様式９・１０】実施報告書!AA59","v":18240},{"$f":"【様式９・１０】実施報告書!F60","v":""},{"$f":"【様式９・１０】実施報告書!N60","v":"0"},{"$f":"【様式９・１０】実施報告書!S60","v":"0"},{"$f":"【様式９・１０】実施報告書!X60","v":"0"},{"$f":"【様式９・１０】実施報告書!AA60","v":0},{"$f":"【様式９・１０】実施報告書!F61","v":""},{"$f":"【様式９・１０】実施報告書!N61","v":"0"},{"$f":"【様式９・１０】実施報告書!S61","v":"0"},{"$f":"【様式９・１０】実施報告書!X61","v":"0"},{"$f":"【様式９・１０】実施報告書!AA61","v":0},{"$f":"【様式９・１０】実施報告書!F62","v":""},{"$f":"【様式９・１０】実施報告書!N62","v":"0"},{"$f":"【様式９・１０】実施報告書!S62","v":"0"},{"$f":"【様式９・１０】実施報告書!X62","v":"0"},{"$f":"【様式９・１０】実施報告書!AA62","v":0},{"$f":"【様式９・１０】実施報告書!F63","v":""},{"$f":"【様式９・１０】実施報告書!N63","v":"0"},{"$f":"【様式９・１０】実施報告書!S63","v":"0"},{"$f":"【様式９・１０】実施報告書!X63","v":"0"},{"$f":"【様式９・１０】実施報告書!AA63","v":0},{"$f":"【様式９・１０】実施報告書!F64","v":""},{"$f":"【様式９・１０】実施報告書!N64","v":"0"},{"$f":"【様式９・１０】実施報告書!S64","v":"0"},{"$f":"【様式９・１０】実施報告書!X64","v":"0"},{"$f":"【様式９・１０】実施報告書!AA64","v":0},{"$f":"【様式９・１０】実施報告書!F65","v":3},{"$f":"【様式９・１０】実施報告書!AA65","v":54720},{"$f":"【様式９・１０】実施報告書!B67","v":"○○○○○○○○○○○○○○○○○○○○○○○○○○○○○○○○○○○○○○○○○○○○○○○○○○○○○○○○○○○○○○○○○○○○○○○○○○○○○○○○○○○○○○○○○○○○○○○○○○○○○○○○○○○○○○○○○○○○○○○○○○○○○○○○○○○○○○○○○○○○○○○○○○○○○○○○○○○○○○○○○○○○○○○○○○○○"},{"$f":"【様式９・１０】実施報告書!B69","v":"○○○○○○○○○○○○○○○○○○○○○○○○○○○○○○○○○○○○○○○○○○○○○○○○○○○○○○○○○○○○○○○○○○○○○○○○○○○○○○○○○○○○○○○○○○○○○○○○○○○○○○○○○○○○○○○○○○○○○○○○○○○○○○○○○○○○○○○○○○○○○○○○○○○○○○○○○○○○○○○○○○○○○○○○○○○○"},{"$f":"【様式９・１０】実施報告書!E72","v":"2022-06-23"},{"$f":"【様式９・１０】実施報告書!S72","v":"午前と午後"},{"$f":"【様式９・１０】実施報告書!AA72","v":150},{"$f":"【様式９・１０】実施報告書!E73","v":"特別活動"},{"$f":"【様式９・１０】実施報告書!S73","v":"文化的行事"},{"$f":"【様式９・１０】実施報告書!G74","v":300},{"$f":"【様式９・１０】実施報告書!P74","v":"全校児童/生徒"},{"$f":"【様式９・１０】実施報告書!S75","v":""},{"$f":"【様式９・１０】実施報告書!F77","v":"次代　太郎"},{"$f":"【様式９・１０】実施報告書!N77","v":2},{"$f":"【様式９・１０】実施報告書!S77","v":1},{"$f":"【様式９・１０】実施報告書!X77","v":"0"},{"$f":"【様式９・１０】実施報告書!AA77","v":18240},{"$f":"【様式９・１０】実施報告書!F78","v":"音楽　花子"},{"$f":"【様式９・１０】実施報告書!N78","v":2},{"$f":"【様式９・１０】実施報告書!S78","v":"0"},{"$f":"【様式９・１０】実施報告書!X78","v":"0"},{"$f":"【様式９・１０】実施報告書!AA78","v":13040},{"$f":"【様式９・１０】実施報告書!F79","v":"演奏　太郎"},{"$f":"【様式９・１０】実施報告書!N79","v":2},{"$f":"【様式９・１０】実施報告書!S79","v":"0"},{"$f":"【様式９・１０】実施報告書!X79","v":"0"},{"$f":"【様式９・１０】実施報告書!AA79","v":13040},{"$f":"【様式９・１０】実施報告書!F80","v":"弦楽　花子"},{"$f":"【様式９・１０】実施報告書!N80","v":2},{"$f":"【様式９・１０】実施報告書!S80","v":"0"},{"$f":"【様式９・１０】実施報告書!X80","v":"0"},{"$f":"【様式９・１０】実施報告書!AA80","v":13040},{"$f":"【様式９・１０】実施報告書!F81","v":"鍵盤　太郎"},{"$f":"【様式９・１０】実施報告書!N81","v":2},{"$f":"【様式９・１０】実施報告書!S81","v":"0"},{"$f":"【様式９・１０】実施報告書!X81","v":"0"},{"$f":"【様式９・１０】実施報告書!AA81","v":13040},{"$f":"【様式９・１０】実施報告書!F82","v":""},{"$f":"【様式９・１０】実施報告書!N82","v":"0"},{"$f":"【様式９・１０】実施報告書!S82","v":"0"},{"$f":"【様式９・１０】実施報告書!X82","v":"0"},{"$f":"【様式９・１０】実施報告書!AA82","v":0},{"$f":"【様式９・１０】実施報告書!F83","v":""},{"$f":"【様式９・１０】実施報告書!N83","v":"0"},{"$f":"【様式９・１０】実施報告書!S83","v":"0"},{"$f":"【様式９・１０】実施報告書!X83","v":"0"},{"$f":"【様式９・１０】実施報告書!AA83","v":0},{"$f":"【様式９・１０】実施報告書!F84","v":""},{"$f":"【様式９・１０】実施報告書!N84","v":"0"},{"$f":"【様式９・１０】実施報告書!S84","v":"0"},{"$f":"【様式９・１０】実施報告書!X84","v":"0"},{"$f":"【様式９・１０】実施報告書!AA84","v":0},{"$f":"【様式９・１０】実施報告書!F85","v":5},{"$f":"【様式９・１０】実施報告書!AA85","v":70400},{"$f":"【様式９・１０】実施報告書!B87","v":"○○○○○○○○○○○○○○○○○○○○○○○○○○○○○○○○○○○○○○○○○○○○○○○○○○○○○○○○○○○○○○○○○○○○○○○○○○○○○○○○○○○○○○○○○○○○○○○○○○○○○○○○○○○○○○○○○○○○○○○○○○○○○○○○○○○○○○○○○○○○○○○○○○○○○○○○○○○○○○○○○○○○○○○○○○○○"},{"$f":"【様式９・１０】実施報告書!B89","v":"○○○○○○○○○○○○○○○○○○○○○○○○○○○○○○○○○○○○○○○○○○○○○○○○○○○○○○○○○○○○○○○○○○○○○○○○○○○○○○○○○○○○○○○○○○○○○○○○○○○○○○○○○○○○○○○○○○○○○○○○○○○○○○○○○○○○○○○○○○○○○○○○○○○○○○○○○○○○○○○○○○○○○○○○○○○○"},{"$f":"【様式９・１０】実施報告書!N99","v":267230},{"$f":"【様式９・１０】実施報告書!N100","v":65390},{"$f":"【様式９・１０】実施報告書!N101","v":48700},{"$f":"【様式９・１０】実施報告書!M102","v":381320},{"$f":"【様式２・３】実施希望調書!E13","v":"音楽"},{"$f":"【様式２・３】実施希望調書!I13","v":"C　弦楽器"},{"$f":"【様式９・１０】実施報告書!F47+【様式９・１０】実施報告書!F65+【様式９・１０】実施報告書!F85","v":11},{"$f":"【様式９・１０】実施報告書!G36+【様式９・１０】実施報告書!G54+【様式９・１０】実施報告書!G74","v":500}]

{"sheet":"【様式４】講師","index":4,"n_rows":46,"n_cols":41,"rows_kept":46,"cut":false,"hidden":false,"merged":[[10,4,10,14],[10,15,10,18],[10,19,10,29],[10,30,10,33],[11,34,11,41],[4,20,4,21],[4,29,4,33],[4,34,4,41],[0,3,0,41],[3,0,3,41],[4,6,4,11],[4,14,4,19],[4,22,4,27],[0,0,0,2],[1,0,1,41],[2,0,2,41],[4,0,4,3],[4,4,4,5],[4,12,4,13],[13,5,13,6],[13,8,13,10],[13,19,13,41],[12,0,12,3],[12,4,12,14],[12,15,12,18],[12,19,12,29],[12,30,12,33],[7,0,7,3],[7,4,7,18],[7,19,7,22],[7,23,7,29],[10,34,10,41],[11,0,11,3],[11,4,11,14],[11,15,11,18],[11,19,11,29],[11,30,11,33],[9,29,9,30],[9,31,9,32],[9,34,9,35],[9,37,9,38],[9,40,9,41],[10,0,10,3],[17,0,17,1],[17,3,17,4],[17,6,17,20],[17,21,17,22],[17,24,17,25],[17,27,17,41],[12,34,12,41],[13,11,13,18],[14,0,14,3],[14,4,14,14],[14,15,14,18],[14,19,14,29],[14,30,14,41],[16,0,16,1],[16,3,16,4],[16,6,16,20],[16,21,16,22],[16,24,16,25],[16,27,16,41],[15,0,15,20],[15,21,15,22],[15,24,15,25],[15,27,15,41],[13,0,13,3],[18,27,18,41],[26,16,26,18],[26,19,26,21],[26,22,26,24],[26,0,26,3],[27,28,27,32],[22,4,23,10],[22,11,23,12],[24,0,25,3],[24,4,25,5],[24,39,25,41],[25,6,25,8],[25,10,25,12],[24,33,25,35],[24,36,25,38],[18,0,18,1],[18,3,18,4],[18,6,18,20],[18,21,18,22],[18,24,18,25],[27,39,27,41],[27,22,27,24],[27,25,27,27],[27,33,27,35],[27,36,27,38],[27,19,27,21],[28,36,28,38],[24,6,24,12],[24,13,25,15],[24,16,25,18],[26,6,26,8],[26,10,26,12],[26,13,26,15],[27,0,27,3],[27,4,27,5],[27,6,27,8],[27,10,27,12],[27,13,27,15],[27,16,27,18],[28,19,28,21],[28,22,28,24],[28,25,28,27],[28,0,28,3],[28,4,28,5],[28,6,28,8],[28,10,28,12],[28,13,28,15],[28,16,28,18],[28,39,28,41],[29,0,29,3],[29,4,29,5],[29,6,29,8],[29,10,29,12],[29,13,29,15],[29,33,29,35],[29,36,29,38],[29,39,29,41],[29,22,29,24],[29,16,29,18],[29,19,29,21],[28,33,28,35],[28,28,28,32],[29,28,29,32],[29,25,29,27],[31,39,31,41],[30,0,30,3],[30,4,30,5],[30,6,30,8],[30,10,30,12],[30,13,30,15],[30,16,30,18],[30,39,30,41],[31,0,31,3],[31,4,31,5],[31,6,31,8],[31,10,31,12],[31,13,31,15],[31,16,31,18],[31,19,31,21],[31,22,31,24],[31,25,31,27],[30,28,30,32],[30,22,30,24],[30,25,30,27],[30,33,30,35],[30,19,30,21],[32,4,32,5],[32,6,32,8],[32,10,32,12],[32,13,32,15],[32,16,32,18],[32,19,32,21],[30,36,30,38],[31,33,31,35],[31,36,31,38],[34,0,34,3],[34,4,34,5],[34,6,34,8],[34,10,34,12],[34,13,34,15],[34,16,34,18],[32,22,32,24],[32,25,32,27],[33,39,33,41],[33,22,33,24],[33,25,33,27],[33,33,33,35],[33,36,33,38],[32,33,32,35],[32,36,32,38],[32,39,32,41],[33,0,33,3],[33,4,33,5],[33,6,33,8],[33,10,33,12],[33,13,33,15],[33,16,33,18],[33,19,33,21],[32,0,32,3],[34,19,34,21],[34,22,34,24],[34,25,34,27],[35,22,35,24],[35,25,35,27],[36,39,36,41],[36,22,36,24],[36,25,36,27],[36,33,36,35],[36,36,36,38],[45,22,45,41],[5,0,5,41],[6,4,6,41],[7,30,7,41],[8,0,8,41],[9,5,9,28],[19,0,19,41],[22,13,23,13],[36,4,36,5],[36,6,36,8],[36,10,36,12],[36,13,36,15],[36,16,36,18],[36,19,36,21],[40,0,40,41],[35,0,35,3],[35,4,35,5],[35,6,35,8],[35,10,35,12],[35,13,35,15],[35,33,35,35],[35,36,35,38],[35,39,35,41],[35,16,35,18],[20,0,21,3],[22,0,23,3],[24,28,25,32],[26,28,26,32],[26,4,26,5],[26,33,26,35],[26,36,26,38],[26,39,26,41],[26,25,26,27],[24,19,25,21],[24,22,25,24],[24,25,25,27],[20,18,23,41],[20,4,21,17],[44,15,44,41],[42,0,43,41],[38,36,38,38],[38,39,39,41],[39,25,39,27],[39,33,39,35],[39,36,39,38],[31,28,31,32],[41,0,41,3],[32,28,32,32],[33,28,33,32],[34,28,34,32],[35,28,35,32],[36,28,36,32],[37,28,37,32],[38,28,38,32],[39,28,39,32],[35,19,35,21],[36,0,36,3],[34,33,34,35],[34,36,34,38],[34,39,34,41],[37,10,37,12],[37,13,37,15],[37,33,37,35],[37,36,37,38],[37,39,37,41],[38,0,39,24],[38,25,38,27],[38,33,38,35],[37,0,37,3],[37,4,37,5],[37,6,37,8],[37,16,37,18],[37,19,37,21],[37,22,37,24],[37,25,37,27]]}
["様式４"]
["令和4年度文化芸術による子供育成推進事業（芸術家の派遣事業）"]
["被派遣者 略歴書(兼)旅費計算書"]
[]
["実施日",null,null,null,"第1回",null,{"$f":"IF(【様式２・３】実施希望調書!E25=\"\",\"\",【様式２・３】実施希望調書!E25)","v":"2022-06-10"},null,null,null,null,null,"第2回",null,{"$f":"IF(【様式２・３】実施希望調書!E43=\"\",\"\",【様式２・３】実施希望調書!E43)","v":"2022-06-17"},null,null,null,null,null,"第3回",null,{"$f":"IF(【様式２・３】実施希望調書!E61=\"\",\"\",【様式２・３】実施希望調書!E61)","v":"2022-06-23"},null,null,null,null,null,null,"都道府県・\n政令指定都市名",null,null,null,null,{"$f":"IF(【様式２・３】実施希望調書!E4=\"\",\"\",【様式２・３】実施希望調書!E4)","v":"北海道"}]
[]
["①派遣先"]
["学校名",null,null,null,{"$f":"IF(【様式２・３】実施希望調書!E7=\"\",\"\",【様式２・３】実施希望調書!E7)","v":"○○市立文化小学校"},null,null,null,null,null,null,null,null,null,null,null,null,null,null,"最寄駅/バス停",null,null,null,"○○駅"]
[]
["②被派遣者",null,null,null,null,null,null,null,null,null,null,null,null,null,null,null,null,null,null,null,null,null,null,null,null,null,null,null,null,"令和",null,3,null,"年",8,null,"月",1,null,"日","現在"]
["ふりがな",null,null,null,"げいじゅつ　はなこ",null,null,null,null,null,null,null,null,null,null,"ふりがな",null,null,null,"ぶんか　はなこ",null,null,null,null,null,null,null,null,null,null,"生年月日",null,null,null,"1980-05-15"]
["本名",null,null,null,{"$f":"IF(【様式２・３】実施希望調書!G93=\"\",\"\",【様式２・３】実施希望調書!G93)","v":"芸術　花子"},null,null,null,null,null,null,null,null,null,null,"芸名",null,null,null,"文化　はなこ",null,null,null,null,null,null,null,null,null,null,"性別",null,null,null,"女"]
["専門分野",null,null,null,"ヴァイオリン",null,null,null,null,null,null,null,null,null,null,"所属団体",null,null,null,"●●室内管弦楽団",null,null,null,null,null,null,null,null,null,null,"職業",null,null,null,"ヴァイオリニスト"]
["現住所",null,null,null,"〒","XXX",null,"-","XXXX",null,null,"○○県",null,null,null,null,null,null,null,"○○県××市××町XXX-XX"]
["最寄交通機関",null,null,null,"JR○○線",null,null,null,null,null,null,null,null,null,null,"最寄駅/バス停",null,null,null,"××駅"]
["■専門分野に係る主な賞歴、活動実績など",null,null,null,null,null,null,null,null,null,null,null,null,null,null,null,null,null,null,null,null,null,null,"年",null,null,"月"]
[1990,null,"年",1,null,"月","○○賞入賞",null,null,null,null,null,null,null,null,null,null,null,null,null,null,null,null,"年",null,null,"月"]
[2000,null,"年",1,null,"月","○○賞入賞",null,null,null,null,null,null,null,null,null,null,null,null,null,null,null,null,"年",null,null,"月"]
[null,null,"年",null,null,"月",null,null,null,null,null,null,null,null,null,null,null,null,null,null,null,null,null,"年",null,null,"月"]
[]
["③旅費",null,null,null,"↓（申請時）様式3に転記してください\n　（報告時）様式10に転記してください",null,null,null,null,null,null,null,null,null,null,null,null,null,"※本事業の旅費基準に従って計上してください\n※乗り換え毎に行を分けて記入してください\n※交通機関名欄は、プルダウンより選択してください\n※バス運賃の根拠書類を添付してください（運賃表、検索画面のコピー等）\n※距離を必ず記入してください"]
[]
["旅費合計\n（a+b+c+d)",null,null,null,{"$f":"Z40+AC40+AH40+AK40","v":37880},null,null,null,null,null,null,"円"]
[]
["日付",null,null,null,"曜日",null,"移動区間",null,null,null,null,null,null,"※交通\n機関名",null,null,"※距離\n(㎞)",null,null,"運賃\n乗車券",null,null,"特急\n急行料金",null,null,"交通費\n小計",null,null,"車 賃",null,null,null,null,"日当",null,null,"宿泊費",null,null,"宿泊地"]
[null,null,null,null,null,null,"発地",null,null,"→","着地"]
["2022-06-10",null,null,null,{"$f":"IF(A27=\"\",\"\",A27)","v":44722},null,"××駅",null,null,"→","△△駅",null,null,"JR特急あり",null,null,100,null,null,2000,null,null,1000,null,null,{"$f":"SUM(T27:Y27)","v":3000},null,null,null,null,null,null,null,1100]
[null,null,null,null,"",null,"△△駅",null,null,"→","○○駅",null,null,"私鉄特急なし",null,null,5,null,null,200,null,null,null,null,null,200]
[null,null,null,null,"",null,"○○駅",null,null,"→","△△駅",null,null,"私鉄特急なし",null,null,5,null,null,200,null,null,null,null,null,200]
[null,null,null,null,"",null,"△△駅",null,null,"→","××駅",null,null,"JR特急あり",null,null,100,null,null,2000,null,null,1000,null,null,3000]
["2022-06-17",null,null,null,44729,null,"××駅",null,null,"→","△△駅",null,null,"JR特急あり",null,null,100,null,null,2000,null,null,1000,null,null,3000,null,null,null,null,null,null,null,1100]
[null,null,null,null,"",null,"△△駅",null,null,"→","○○駅",null,null,"私鉄特急なし",null,null,5,null,null,200,null,null,null,null,null,200]
[null,null,null,null,"",null,"○○駅",null,null,"→","△△駅",null,null,"私鉄特急なし",null,null,5,null,null,200,null,null,null,null,null,200]
[null,null,null,null,"",null,"△△駅",null,null,"→","××駅",null,null,"JR特急あり",null,null,100,null,null,2000,null,null,1000,null,null,3000]
["2022-06-22",null,null,null,44734,null,"自宅",null,null,"→","○○小学校",null,null,"自家用車",null,null,120,null,null,null,null,null,null,null,null,0,null,null,null,null,null,null,null,1100,null,null,9800,null,null,"○○市"]
[null,null,null,null,"",null,"××IC",null,null,"→","○○IC",null,null,"その他",null,null,80,null,null,null,null,null,1000,null,null,1000]
["2022-06-23",null,null,null,44735,null,"○○小学校",null,null,"→","自宅",null,null,"自家用車",null,null,120,null,null,null,null,null,null,null,null,0,null,null,null,null,null,null,null,1100]
[null,null,null,null,"",null,"○○IC",null,null,"→","××IC",null,null,"その他",null,null,80,null,null,null,null,null,1000,null,null,1000]
["合　計",null,null,null,null,null,null,null,null,null,null,null,null,null,null,null,null,null,null,null,null,null,null,null,null,"a",null,null,"b",null,null,null,null,"c",null,null,"d"]
[null,null,null,null,null,null,null,null,null,null,null,null,null,null,null,null,null,null,null,null,null,null,null,null,null,{"$f":"SUM(Z27:AB38)","v":14800},null,null,{"$f":"ROUNDDOWN((SUMIFS(Q27:S38,N27:P38,\"自家用車\")),0)*37","v":8880},null,null,null,null,{"$f":"SUM(AH27:AJ38)","v":4400},null,null,{"$f":"SUM(AK27:AM38)","v":9800}]
[]
["(備　考)",null,null,null,null,"※出発地が現住所と異なる場合は出発地（駅名/バス停名）及びその理由を記入してください"]
["6/22、23は楽器運搬のため自家用車を利用。\n6/22は、翌日の授業開始時間に間に合わないため宿泊。"]
[]
["※本事業で得た個人情報は、本事業内のみで使用します"]
["※本事業の専用ウェブページにある[個人情報について]に同意していただいたものとします"]

{"sheet":"【様式４】補助者①","index":5,"n_rows":46,"n_cols":41,"rows_kept":46,"cut":false,"hidden":false,"merged":[[0,0,0,2],[0,3,0,41],[1,0,1,41],[2,0,2,41],[3,0,3,41],[4,0,4,3],[4,4,4,5],[4,6,4,11],[4,12,4,13],[4,14,4,19],[7,0,7,3],[7,4,7,18],[7,19,7,22],[7,23,7,29],[7,30,7,41],[8,0,8,41],[4,20,4,21],[4,22,4,27],[4,29,4,33],[4,34,4,41],[5,0,5,41],[6,4,6,41],[10,0,10,3],[10,4,10,14],[10,15,10,18],[10,19,10,29],[10,30,10,33],[10,34,10,41],[9,5,9,28],[9,29,9,30],[9,31,9,32],[9,34,9,35],[9,37,9,38],[9,40,9,41],[12,0,12,3],[12,4,12,14],[12,15,12,18],[12,19,12,29],[12,30,12,33],[12,34,12,41],[11,0,11,3],[11,4,11,14],[11,15,11,18],[11,19,11,29],[11,30,11,33],[11,34,11,41],[13,0,13,3],[13,5,13,6],[13,8,13,10],[13,11,13,18],[13,19,13,41],[14,0,14,3],[14,4,14,14],[14,15,14,18],[14,19,14,29],[14,30,14,41],[17,0,17,1],[17,3,17,4],[17,6,17,20],[17,21,17,22],[17,24,17,25],[17,27,17,41],[15,0,15,20],[15,21,15,22],[15,24,15,25],[15,27,15,41],[16,0,16,1],[16,3,16,4],[16,6,16,20],[16,21,16,22],[16,24,16,25],[16,27,16,41],[19,0,19,41],[20,0,21,3],[22,0,23,3],[22,4,23,10],[22,11,23,12],[22,13,23,13],[18,0,18,1],[18,3,18,4],[18,6,18,20],[18,21,18,22],[18,24,18,25],[18,27,18,41],[20,18,23,41],[20,4,21,17],[24,22,25,24],[24,25,25,27],[24,28,25,32],[24,33,25,35],[24,36,25,38],[24,39,25,41],[24,0,25,3],[24,4,25,5],[24,6,24,12],[24,13,25,15],[24,16,25,18],[24,19,25,21],[25,6,25,8],[25,10,25,12],[26,39,26,41],[27,0,27,3],[27,4,27,5],[27,6,27,8],[27,10,27,12],[27,13,27,15],[27,16,27,18],[27,19,27,21],[27,22,27,24],[27,25,27,27],[26,19,26,21],[26,22,26,24],[26,25,26,27],[26,28,26,32],[26,33,26,35],[26,36,26,38],[26,0,26,3],[26,4,26,5],[26,6,26,8],[26,10,26,12],[26,13,26,15],[26,16,26,18],[27,28,27,32],[27,33,27,35],[27,36,27,38],[27,39,27,41],[28,0,28,3],[28,4,28,5],[28,6,28,8],[28,10,28,12],[28,13,28,15],[28,16,28,18],[28,39,28,41],[28,19,28,21],[28,22,28,24],[28,25,28,27],[28,28,28,32],[28,33,28,35],[28,36,28,38],[29,39,29,41],[30,0,30,3],[30,4,30,5],[30,6,30,8],[30,10,30,12],[30,13,30,15],[30,16,30,18],[30,39,30,41],[30,19,30,21],[30,22,30,24],[30,25,30,27],[30,28,30,32],[30,33,30,35],[30,36,30,38],[29,0,29,3],[29,4,29,5],[29,6,29,8],[29,10,29,12],[29,13,29,15],[29,16,29,18],[29,19,29,21],[29,22,29,24],[29,25,29,27],[31,10,31,12],[31,13,31,15],[31,16,31,18],[31,19,31,21],[31,22,31,24],[31,25,31,27],[29,28,29,32],[29,33,29,35],[29,36,29,38],[33,16,33,18],[33,19,33,21],[33,22,33,24],[33,25,33,27],[31,28,31,32],[31,33,31,35],[31,36,31,38],[31,39,31,41],[32,0,32,3],[32,4,32,5],[32,6,32,8],[32,10,32,12],[32,13,32,15],[32,16,32,18],[32,39,32,41],[32,19,32,21],[32,22,32,24],[32,25,32,27],[32,28,32,32],[32,33,32,35],[32,36,32,38],[31,0,31,3],[31,4,31,5],[31,6,31,8],[35,22,35,24],[35,25,35,27],[33,28,33,32],[33,33,33,35],[33,36,33,38],[33,39,33,41],[34,0,34,3],[34,4,34,5],[34,6,34,8],[34,10,34,12],[34,13,34,15],[34,16,34,18],[34,39,34,41],[34,19,34,21],[34,22,34,24],[34,25,34,27],[34,28,34,32],[34,33,34,35],[34,36,34,38],[33,0,33,3],[33,4,33,5],[33,6,33,8],[33,10,33,12],[33,13,33,15],[35,28,35,32],[35,33,35,35],[35,36,35,38],[35,39,35,41],[36,0,36,3],[36,4,36,5],[36,6,36,8],[36,10,36,12],[36,13,36,15],[36,16,36,18],[36,39,36,41],[36,19,36,21],[36,22,36,24],[36,25,36,27],[36,28,36,32],[36,33,36,35],[36,36,36,38],[35,0,35,3],[35,4,35,5],[35,6,35,8],[35,10,35,12],[35,13,35,15],[35,16,35,18],[35,19,35,21],[37,28,37,32],[37,33,37,35],[37,36,37,38],[37,39,37,41],[38,0,39,24],[38,25,38,27],[38,28,38,32],[38,33,38,35],[38,36,38,38],[38,39,39,41],[37,0,37,3],[37,4,37,5],[37,6,37,8],[37,10,37,12],[37,13,37,15],[37,16,37,18],[37,19,37,21],[37,22,37,24],[37,25,37,27],[42,0,43,41],[44,15,44,41],[45,22,45,41],[39,25,39,27],[39,28,39,32],[39,33,39,35],[39,36,39,38],[40,0,40,41],[41,0,41,3]]}
["様式４"]
["令和4年度文化芸術による子供育成推進事業（芸術家の派遣事業）"]
["被派遣者 略歴書(兼)旅費計算書"]
[]
["実施日",null,null,null,"第1回",null,{"$f":"IF(【様式２・３】実施希望調書!E25=\"\",\"\",【様式２・３】実施希望調書!E25)","v":"2022-06-10"},null,null,null,null,null,"第2回",null,{"$f":"IF(【様式２・３】実施希望調書!E43=\"\",\"\",【様式２・３】実施希望調書!E43)","v":"2022-06-17"},null,null,null,null,null,"第3回",null,{"$f":"IF(【様式２・３】実施希望調書!E61=\"\",\"\",【様式２・３】実施希望調書!E61)","v":"2022-06-23"},null,null,null,null,null,null,"都道府県・\n政令指定都市名",null,null,null,null,{"$f":"IF(【様式２・３】実施希望調書!E4=\"\",\"\",【様式２・３】実施希望調書!E4)","v":"北海道"}]
[]
["①派遣先"]
["学校名",null,null,null,{"$f":"IF(【様式２・３】実施希望調書!E7=\"\",\"\",【様式２・３】実施希望調書!E7)","v":"○○市立文化小学校"},null,null,null,null,null,null,null,null,null,null,null,null,null,null,"最寄駅/バス停",null,null,null,"○○駅"]
[]
["②被派遣者",null,null,null,null,null,null,null,null,null,null,null,null,null,null,null,null,null,null,null,null,null,null,null,null,null,null,null,null,"令和",null,3,null,"年",8,null,"月",1,null,"日","現在"]
["ふりがな",null,null,null,"じだい　たろう",null,null,null,null,null,null,null,null,null,null,"ふりがな",null,null,null,null,null,null,null,null,null,null,null,null,null,null,"生年月日",null,null,null,"1820/2/2"]
["本名",null,null,null,{"$f":"IF(【様式２・３】実施希望調書!G94=\"\",\"　\",【様式２・３】実施希望調書!G94)","v":"次代　太郎"},null,null,null,null,null,null,null,null,null,null,"芸名",null,null,null,null,null,null,null,null,null,null,null,null,null,null,"性別",null,null,null,"男"]
["専門分野",null,null,null,"ヴァイオリン",null,null,null,null,null,null,null,null,null,null,"所属団体",null,null,null,"●●室内管弦楽団",null,null,null,null,null,null,null,null,null,null,"職業",null,null,null,"ヴァイオリニスト"]
["現住所",null,null,null,"〒","000",null,"-","0000",null,null,null,null,null,null,null,null,null,null,"○○市××町1"]
["最寄交通機関",null,null,null,"JR○○線",null,null,null,null,null,null,null,null,null,null,"最寄駅/バス停",null,null,null,"B駅"]
["■専門分野に係る主な賞歴、活動実績など",null,null,null,null,null,null,null,null,null,null,null,null,null,null,null,null,null,null,null,null,null,null,"年",null,null,"月"]
[2010,null,"年",1,null,"月","○○賞入賞",null,null,null,null,null,null,null,null,null,null,null,null,null,null,null,null,"年",null,null,"月"]
[2012,null,"年",2,null,"月","○○賞入賞",null,null,null,null,null,null,null,null,null,null,null,null,null,null,null,null,"年",null,null,"月"]
[null,null,"年",null,null,"月",null,null,null,null,null,null,null,null,null,null,null,null,null,null,null,null,null,"年",null,null,"月"]
[]
["③旅費",null,null,null,"↓（申請時）様式3に転記してください\n　（報告時）様式10に転記してください",null,null,null,null,null,null,null,null,null,null,null,null,null,"※本事業の旅費基準に従って計上してください\n※乗り換え毎に行を分けて記入してください\n※交通機関名欄は、プルダウンより選択してください\n※バス運賃の根拠書類を添付してください（運賃表、検索画面のコピー等）\n※距離を必ず記入してください"]
[]
["旅費合計\n（a+b+c+d)",null,null,null,{"$f":"Z40+AC40+AH40+AK40","v":3000},null,null,null,null,null,null,"円"]
[]
["日付",null,null,null,"曜日",null,"移動区間",null,null,null,null,null,null,"※交通\n機関名",null,null,"※距離\n(㎞)",null,null,"運賃\n乗車券",null,null,"特急\n急行料金",null,null,"交通費\n小計",null,null,"車 賃",null,null,null,null,"日当",null,null,"宿泊費",null,null,"宿泊地"]
[null,null,null,null,null,null,"発地",null,null,"→","着地"]
["2022-06-10",null,null,null,{"$f":"IF(A27=\"\",\"\",A27)","v":44722},null,"B駅",null,null,"→","○○駅",null,null,"JR特急なし",null,null,20,null,null,500,null,null,null,null,null,{"$f":"SUM(T27:Y27)","v":500}]
["2022-06-10",null,null,null,44722,null,"○○駅",null,null,"→","B駅",null,null,"JR特急なし",null,null,20,null,null,500,null,null,null,null,null,500]
["2022-06-17",null,null,null,44729,null,"B駅",null,null,"→","○○駅",null,null,"JR特急なし",null,null,20,null,null,500,null,null,null,null,null,500]
["2022-06-17",null,null,null,44729,null,"○○駅",null,null,"→","B駅",null,null,"JR特急なし",null,null,20,null,null,500,null,null,null,null,null,500]
["2022-06-23",null,null,null,44735,null,"B駅",null,null,"→","○○駅",null,null,"JR特急なし",null,null,20,null,null,500,null,null,null,null,null,500]
["2022-06-23",null,null,null,44735,null,"○○駅",null,null,"→","B駅",null,null,"JR特急なし",null,null,20,null,null,500,null,null,null,null,null,500]
[null,null,null,null,{"$f":"IF(A33=\"\",\"\",A33)","v":""},null,null,null,null,"→",null,null,null,null,null,null,null,null,null,null,null,null,null,null,null,{"$f":"SUM(T33:Y33)","v":0}]
[null,null,null,null,"",null,null,null,null,"→",null,null,null,null,null,null,null,null,null,null,null,null,null,null,null,0]
[null,null,null,null,"",null,null,null,null,"→",null,null,null,null,null,null,null,null,null,null,null,null,null,null,null,0]
[null,null,null,null,"",null,null,null,null,"→",null,null,null,null,null,null,null,null,null,null,null,null,null,null,null,0]
[null,null,null,null,"",null,null,null,null,"→",null,null,null,null,null,null,null,null,null,null,null,null,null,null,null,0]
[null,null,null,null,"",null,null,null,null,"→",null,null,null,null,null,null,null,null,null,null,null,null,null,null,null,0]
["合　計",null,null,null,null,null,null,null,null,null,null,null,null,null,null,null,null,null,null,null,null,null,null,null,null,"a",null,null,"b",null,null,null,null,"c",null,null,"d"]
[null,null,null,null,null,null,null,null,null,null,null,null,null,null,null,null,null,null,null,null,null,null,null,null,null,{"$f":"SUM(Z27:AB38)","v":3000},null,null,{"$f":"ROUNDDOWN((SUMIFS(Q27:S38,N27:P38,\"自家用車\")),0)*37","v":0},null,null,null,null,{"$f":"SUM(AH27:AJ38)","v":0},null,null,{"$f":"SUM(AK27:AM38)","v":0}]
[]
["(備　考)",null,null,null,null,"※出発地が現住所と異なる場合は出発地（駅名/バス停名）及びその理由を記入してください"]
[]
[]
["※本事業で得た個人情報は、本事業内のみで使用します"]
["※本事業の専用ウェブページにある[個人情報について]に同意していただいたものとします"]

{"sheet":"【様式４】補助者②","index":6,"n_rows":46,"n_cols":41,"rows_kept":46,"cut":false,"hidden":false,"merged":[[0,0,0,2],[0,3,0,41],[1,0,1,41],[2,0,2,41],[3,0,3,41],[4,0,4,3],[4,4,4,5],[4,6,4,11],[4,12,4,13],[4,14,4,19],[7,0,7,3],[7,4,7,18],[7,19,7,22],[7,23,7,29],[7,30,7,41],[8,0,8,41],[4,20,4,21],[4,22,4,27],[4,29,4,33],[4,34,4,41],[5,0,5,41],[6,4,6,41],[10,0,10,3],[10,4,10,14],[10,15,10,18],[10,19,10,29],[10,30,10,33],[10,34,10,41],[9,5,9,28],[9,29,9,30],[9,31,9,32],[9,34,9,35],[9,37,9,38],[9,40,9,41],[12,0,12,3],[12,4,12,14],[12,15,12,18],[12,19,12,29],[12,30,12,33],[12,34,12,41],[11,0,11,3],[11,4,11,14],[11,15,11,18],[11,19,11,29],[11,30,11,33],[11,34,11,41],[13,0,13,3],[13,5,13,6],[13,8,13,10],[13,11,13,18],[13,19,13,41],[14,0,14,3],[14,4,14,14],[14,15,14,18],[14,19,14,29],[14,30,14,41],[17,0,17,1],[17,3,17,4],[17,6,17,20],[17,21,17,22],[17,24,17,25],[17,27,17,41],[15,0,15,20],[15,21,15,22],[15,24,15,25],[15,27,15,41],[16,0,16,1],[16,3,16,4],[16,6,16,20],[16,21,16,22],[16,24,16,25],[16,27,16,41],[19,0,19,41],[20,0,21,3],[22,0,23,3],[22,4,23,10],[22,11,23,12],[22,13,23,13],[18,0,18,1],[18,3,18,4],[18,6,18,20],[18,21,18,22],[18,24,18,25],[18,27,18,41],[20,18,23,41],[20,4,21,17],[24,22,25,24],[24,25,25,27],[24,28,25,32],[24,33,25,35],[24,36,25,38],[24,39,25,41],[24,0,25,3],[24,4,25,5],[24,6,24,12],[24,13,25,15],[24,16,25,18],[24,19,25,21],[25,6,25,8],[25,10,25,12],[26,39,26,41],[27,0,27,3],[27,4,27,5],[27,6,27,8],[27,10,27,12],[27,13,27,15],[27,16,27,18],[27,19,27,21],[27,22,27,24],[27,25,27,27],[26,19,26,21],[26,22,26,24],[26,25,26,27],[26,28,26,32],[26,33,26,35],[26,36,26,38],[26,0,26,3],[26,4,26,5],[26,6,26,8],[26,10,26,12],[26,13,26,15],[26,16,26,18],[27,28,27,32],[27,33,27,35],[27,36,27,38],[27,39,27,41],[28,0,28,3],[28,4,28,5],[28,6,28,8],[28,10,28,12],[28,13,28,15],[28,16,28,18],[28,39,28,41],[28,19,28,21],[28,22,28,24],[28,25,28,27],[28,28,28,32],[28,33,28,35],[28,36,28,38],[29,39,29,41],[30,0,30,3],[30,4,30,5],[30,6,30,8],[30,10,30,12],[30,13,30,15],[30,16,30,18],[30,39,30,41],[30,19,30,21],[30,22,30,24],[30,25,30,27],[30,28,30,32],[30,33,30,35],[30,36,30,38],[29,0,29,3],[29,4,29,5],[29,6,29,8],[29,10,29,12],[29,13,29,15],[29,16,29,18],[29,19,29,21],[29,22,29,24],[29,25,29,27],[31,10,31,12],[31,13,31,15],[31,16,31,18],[31,19,31,21],[31,22,31,24],[31,25,31,27],[29,28,29,32],[29,33,29,35],[29,36,29,38],[33,16,33,18],[33,19,33,21],[33,22,33,24],[33,25,33,27],[31,28,31,32],[31,33,31,35],[31,36,31,38],[31,39,31,41],[32,0,32,3],[32,4,32,5],[32,6,32,8],[32,10,32,12],[32,13,32,15],[32,16,32,18],[32,39,32,41],[32,19,32,21],[32,22,32,24],[32,25,32,27],[32,28,32,32],[32,33,32,35],[32,36,32,38],[31,0,31,3],[31,4,31,5],[31,6,31,8],[35,22,35,24],[35,25,35,27],[33,28,33,32],[33,33,33,35],[33,36,33,38],[33,39,33,41],[34,0,34,3],[34,4,34,5],[34,6,34,8],[34,10,34,12],[34,13,34,15],[34,16,34,18],[34,39,34,41],[34,19,34,21],[34,22,34,24],[34,25,34,27],[34,28,34,32],[34,33,34,35],[34,36,34,38],[33,0,33,3],[33,4,33,5],[33,6,33,8],[33,10,33,12],[33,13,33,15],[35,28,35,32],[35,33,35,35],[35,36,35,38],[35,39,35,41],[36,0,36,3],[36,4,36,5],[36,6,36,8],[36,10,36,12],[36,13,36,15],[36,16,36,18],[36,39,36,41],[36,19,36,21],[36,22,36,24],[36,25,36,27],[36,28,36,32],[36,33,36,35],[36,36,36,38],[35,0,35,3],[35,4,35,5],[35,6,35,8],[35,10,35,12],[35,13,35,15],[35,16,35,18],[35,19,35,21],[37,28,37,32],[37,33,37,35],[37,36,37,38],[37,39,37,41],[38,0,39,24],[38,25,38,27],[38,28,38,32],[38,33,38,35],[38,36,38,38],[38,39,39,41],[37,0,37,3],[37,4,37,5],[37,6,37,8],[37,10,37,12],[37,13,37,15],[37,16,37,18],[37,19,37,21],[37,22,37,24],[37,25,37,27],[42,0,43,41],[44,15,44,41],[45,22,45,41],[39,25,39,27],[39,28,39,32],[39,33,39,35],[39,36,39,38],[40,0,40,41],[41,0,41,3]]}
["様式４"]
["令和4年度文化芸術による子供育成推進事業（芸術家の派遣事業）"]
["被派遣者 略歴書(兼)旅費計算書"]
[]
["実施日",null,null,null,"第1回",null,{"$f":"IF(【様式２・３】実施希望調書!E25=\"\",\"\",【様式２・３】実施希望調書!E25)","v":"2022-06-10"},null,null,null,null,null,"第2回",null,{"$f":"IF(【様式２・３】実施希望調書!E43=\"\",\"\",【様式２・３】実施希望調書!E43)","v":"2022-06-17"},null,null,null,null,null,"第3回",null,{"$f":"IF(【様式２・３】実施希望調書!E61=\"\",\"\",【様式２・３】実施希望調書!E61)","v":"2022-06-23"},null,null,null,null,null,null,"都道府県・\n政令指定都市名",null,null,null,null,{"$f":"IF(【様式２・３】実施希望調書!E4=\"\",\"\",【様式２・３】実施希望調書!E4)","v":"北海道"}]
[]
["①派遣先"]
["学校名",null,null,null,{"$f":"IF(【様式２・３】実施希望調書!E7=\"\",\"\",【様式２・３】実施希望調書!E7)","v":"○○市立文化小学校"},null,null,null,null,null,null,null,null,null,null,null,null,null,null,"最寄駅/バス停",null,null,null,"○○駅"]
[]
["②被派遣者",null,null,null,null,null,null,null,null,null,null,null,null,null,null,null,null,null,null,null,null,null,null,null,null,null,null,null,null,"令和",null,3,null,"年",8,null,"月",1,null,"日","現在"]
["ふりがな",null,null,null,"おんがく　はなこ",null,null,null,null,null,null,null,null,null,null,"ふりがな",null,null,null,null,null,null,null,null,null,null,null,null,null,null,"生年月日",null,null,null,"1975-03-03"]
["本名",null,null,null,{"$f":"IF(【様式２・３】実施希望調書!G95=\"\",\"　\",【様式２・３】実施希望調書!G95)","v":"音楽　花子"},null,null,null,null,null,null,null,null,null,null,"芸名",null,null,null,null,null,null,null,null,null,null,null,null,null,null,"性別",null,null,null,"女"]
["専門分野",null,null,null,"ヴィオラ",null,null,null,null,null,null,null,null,null,null,"所属団体",null,null,null,"●●室内管弦楽団",null,null,null,null,null,null,null,null,null,null,"職業",null,null,null,"ヴィオリスト"]
["現住所",null,null,null,"〒","000",null,"-","0000",null,null,null,null,null,null,null,null,null,null,"○○市××町1"]
["最寄交通機関",null,null,null,"JR○○線",null,null,null,null,null,null,null,null,null,null,"最寄駅/バス停",null,null,null,"C駅"]
["■専門分野に係る主な賞歴、活動実績など",null,null,null,null,null,null,null,null,null,null,null,null,null,null,null,null,null,null,null,null,null,null,"年",null,null,"月"]
[2010,null,"年",1,null,"月","○○賞入賞",null,null,null,null,null,null,null,null,null,null,null,null,null,null,null,null,"年",null,null,"月"]
[2012,null,"年",2,null,"月","○○賞入賞",null,null,null,null,null,null,null,null,null,null,null,null,null,null,null,null,"年",null,null,"月"]
[null,null,"年",null,null,"月",null,null,null,null,null,null,null,null,null,null,null,null,null,null,null,null,null,"年",null,null,"月"]
[]
["③旅費",null,null,null,"↓（申請時）様式3に転記してください\n　（報告時）様式10に転記してください",null,null,null,null,null,null,null,null,null,null,null,null,null,"※本事業の旅費基準に従って計上してください\n※乗り換え毎に行を分けて記入してください\n※交通機関名欄は、プルダウンより選択してください\n※バス運賃の根拠書類を添付してください（運賃表、検索画面のコピー等）\n※距離を必ず記入してください"]
[]
["旅費合計\n（a+b+c+d)",null,null,null,{"$f":"Z40+AC40+AH40+AK40","v":21300},null,null,null,null,null,null,"円"]
[]
["日付",null,null,null,"曜日",null,"移動区間",null,null,null,null,null,null,"※交通\n機関名",null,null,"※距離\n(㎞)",null,null,"運賃\n乗車券",null,null,"特急\n急行料金",null,null,"交通費\n小計",null,null,"車 賃",null,null,null,null,"日当",null,null,"宿泊費",null,null,"宿泊地"]
[null,null,null,null,null,null,"発地",null,null,"→","着地"]
["2022-06-10",null,null,null,{"$f":"IF(A27=\"\",\"\",A27)","v":44722},null,"C駅",null,null,"→","○○駅",null,null,"JR特急あり",null,null,110,null,null,2000,null,null,1000,null,null,{"$f":"SUM(T27:Y27)","v":3000},null,null,null,null,null,null,null,1100]
["2022-06-10",null,null,null,44722,null,"○○駅",null,null,"→","C駅",null,null,"JR特急あり",null,null,110,null,null,2000,null,null,1000,null,null,3000]
["2022-06-17",null,null,null,44729,null,"C駅",null,null,"→","○○駅",null,null,"JR特急あり",null,null,110,null,null,2000,null,null,1000,null,null,3000,null,null,null,null,null,null,null,1100]
["2022-06-17",null,null,null,44729,null,"○○駅",null,null,"→","C駅",null,null,"JR特急あり",null,null,110,null,null,2000,null,null,1000,null,null,3000]
["2022-06-23",null,null,null,44735,null,"C駅",null,null,"→","○○駅",null,null,"JR特急あり",null,null,110,null,null,2000,null,null,1000,null,null,3000,null,null,null,null,null,null,null,1100]
["2022-06-23",null,null,null,44735,null,"○○駅",null,null,"→","C駅",null,null,"JR特急あり",null,null,110,null,null,2000,null,null,1000,null,null,3000]
[null,null,null,null,{"$f":"IF(A33=\"\",\"\",A33)","v":""},null,null,null,null,"→",null,null,null,null,null,null,null,null,null,null,null,null,null,null,null,{"$f":"SUM(T33:Y33)","v":0}]
[null,null,null,null,"",null,null,null,null,"→",null,null,null,null,null,null,null,null,null,null,null,null,null,null,null,0]
[null,null,null,null,"",null,null,null,null,"→",null,null,null,null,null,null,null,null,null,null,null,null,null,null,null,0]
[null,null,null,null,"",null,null,null,null,"→",null,null,null,null,null,null,null,null,null,null,null,null,null,null,null,0]
[null,null,null,null,"",null,null,null,null,"→",null,null,null,null,null,null,null,null,null,null,null,null,null,null,null,0]
[null,null,null,null,"",null,null,null,null,"→",null,null,null,null,null,null,null,null,null,null,null,null,null,null,null,0]
["合　計",null,null,null,null,null,null,null,null,null,null,null,null,null,null,null,null,null,null,null,null,null,null,null,null,"a",null,null,"b",null,null,null,null,"c",null,null,"d"]
[null,null,null,null,null,null,null,null,null,null,null,null,null,null,null,null,null,null,null,null,null,null,null,null,null,{"$f":"SUM(Z27:AB38)","v":18000},null,null,{"$f":"ROUNDDOWN((SUMIFS(Q27:S38,N27:P38,\"自家用車\")),0)*37","v":0},null,null,null,null,{"$f":"SUM(AH27:AJ38)","v":3300},null,null,{"$f":"SUM(AK27:AM38)","v":0}]
[]
["(備　考)",null,null,null,null,"※出発地が現住所と異なる場合は出発地（駅名/バス停名）及びその理由を記入してください"]
[]
[]
["※本事業で得た個人情報は、本事業内のみで使用します"]
["※本事業の専用ウェブページにある[個人情報について]に同意していただいたものとします"]

{"sheet":"【様式４】補助者③","index":7,"n_rows":46,"n_cols":41,"rows_kept":46,"cut":false,"hidden":false,"merged":[[0,0,0,2],[0,3,0,41],[1,0,1,41],[2,0,2,41],[3,0,3,41],[4,0,4,3],[4,4,4,5],[4,6,4,11],[4,12,4,13],[4,14,4,19],[7,0,7,3],[7,4,7,18],[7,19,7,22],[7,23,7,29],[7,30,7,41],[8,0,8,41],[4,20,4,21],[4,22,4,27],[4,29,4,33],[4,34,4,41],[5,0,5,41],[6,4,6,41],[10,0,10,3],[10,4,10,14],[10,15,10,18],[10,19,10,29],[10,30,10,33],[10,34,10,41],[9,5,9,28],[9,29,9,30],[9,31,9,32],[9,34,9,35],[9,37,9,38],[9,40,9,41],[12,0,12,3],[12,4,12,14],[12,15,12,18],[12,19,12,29],[12,30,12,33],[12,34,12,41],[11,0,11,3],[11,4,11,14],[11,15,11,18],[11,19,11,29],[11,30,11,33],[11,34,11,41],[13,0,13,3],[13,5,13,6],[13,8,13,10],[13,11,13,18],[13,19,13,41],[14,0,14,3],[14,4,14,14],[14,15,14,18],[14,19,14,29],[14,30,14,41],[17,0,17,1],[17,3,17,4],[17,6,17,20],[17,21,17,22],[17,24,17,25],[17,27,17,41],[15,0,15,20],[15,21,15,22],[15,24,15,25],[15,27,15,41],[16,0,16,1],[16,3,16,4],[16,6,16,20],[16,21,16,22],[16,24,16,25],[16,27,16,41],[19,0,19,41],[20,0,21,3],[22,0,23,3],[22,4,23,10],[22,11,23,12],[22,13,23,13],[18,0,18,1],[18,3,18,4],[18,6,18,20],[18,21,18,22],[18,24,18,25],[18,27,18,41],[20,18,23,41],[20,4,21,17],[24,22,25,24],[24,25,25,27],[24,28,25,32],[24,33,25,35],[24,36,25,38],[24,39,25,41],[24,0,25,3],[24,4,25,5],[24,6,24,12],[24,13,25,15],[24,16,25,18],[24,19,25,21],[25,6,25,8],[25,10,25,12],[26,39,26,41],[27,0,27,3],[27,4,27,5],[27,6,27,8],[27,10,27,12],[27,13,27,15],[27,16,27,18],[27,19,27,21],[27,22,27,24],[27,25,27,27],[26,19,26,21],[26,22,26,24],[26,25,26,27],[26,28,26,32],[26,33,26,35],[26,36,26,38],[26,0,26,3],[26,4,26,5],[26,6,26,8],[26,10,26,12],[26,13,26,15],[26,16,26,18],[27,28,27,32],[27,33,27,35],[27,36,27,38],[27,39,27,41],[28,0,28,3],[28,4,28,5],[28,6,28,8],[28,10,28,12],[28,13,28,15],[28,16,28,18],[28,39,28,41],[28,19,28,21],[28,22,28,24],[28,25,28,27],[28,28,28,32],[28,33,28,35],[28,36,28,38],[29,39,29,41],[30,0,30,3],[30,4,30,5],[30,6,30,8],[30,10,30,12],[30,13,30,15],[30,16,30,18],[30,39,30,41],[30,19,30,21],[30,22,30,24],[30,25,30,27],[30,28,30,32],[30,33,30,35],[30,36,30,38],[29,0,29,3],[29,4,29,5],[29,6,29,8],[29,10,29,12],[29,13,29,15],[29,16,29,18],[29,19,29,21],[29,22,29,24],[29,25,29,27],[31,10,31,12],[31,13,31,15],[31,16,31,18],[31,19,31,21],[31,22,31,24],[31,25,31,27],[29,28,29,32],[29,33,29,35],[29,36,29,38],[33,16,33,18],[33,19,33,21],[33,22,33,24],[33,25,33,27],[31,28,31,32],[31,33,31,35],[31,36,31,38],[31,39,31,41],[32,0,32,3],[32,4,32,5],[32,6,32,8],[32,10,32,12],[32,13,32,15],[32,16,32,18],[32,39,32,41],[32,19,32,21],[32,22,32,24],[32,25,32,27],[32,28,32,32],[32,33,32,35],[32,36,32,38],[31,0,31,3],[31,4,31,5],[31,6,31,8],[35,22,35,24],[35,25,35,27],[33,28,33,32],[33,33,33,35],[33,36,33,38],[33,39,33,41],[34,0,34,3],[34,4,34,5],[34,6,34,8],[34,10,34,12],[34,13,34,15],[34,16,34,18],[34,39,34,41],[34,19,34,21],[34,22,34,24],[34,25,34,27],[34,28,34,32],[34,33,34,35],[34,36,34,38],[33,0,33,3],[33,4,33,5],[33,6,33,8],[33,10,33,12],[33,13,33,15],[35,28,35,32],[35,33,35,35],[35,36,35,38],[35,39,35,41],[36,0,36,3],[36,4,36,5],[36,6,36,8],[36,10,36,12],[36,13,36,15],[36,16,36,18],[36,39,36,41],[36,19,36,21],[36,22,36,24],[36,25,36,27],[36,28,36,32],[36,33,36,35],[36,36,36,38],[35,0,35,3],[35,4,35,5],[35,6,35,8],[35,10,35,12],[35,13,35,15],[35,16,35,18],[35,19,35,21],[37,28,37,32],[37,33,37,35],[37,36,37,38],[37,39,37,41],[38,0,39,24],[38,25,38,27],[38,28,38,32],[38,33,38,35],[38,36,38,38],[38,39,39,41],[37,0,37,3],[37,4,37,5],[37,6,37,8],[37,10,37,12],[37,13,37,15],[37,16,37,18],[37,19,37,21],[37,22,37,24],[37,25,37,27],[42,0,43,41],[44,15,44,41],[45,22,45,41],[39,25,39,27],[39,28,39,32],[39,33,39,35],[39,36,39,38],[40,0,40,41],[41,0,41,3]]}
["様式４"]
["令和4年度文化芸術による子供育成推進事業（芸術家の派遣事業）"]
["被派遣者 略歴書(兼)旅費計算書"]
[]
["実施日",null,null,null,"第1回",null,{"$f":"IF(【様式２・３】実施希望調書!E25=\"\",\"\",【様式２・３】実施希望調書!E25)","v":"2022-06-10"},null,null,null,null,null,"第2回",null,{"$f":"IF(【様式２・３】実施希望調書!E43=\"\",\"\",【様式２・３】実施希望調書!E43)","v":"2022-06-17"},null,null,null,null,null,"第3回",null,{"$f":"IF(【様式２・３】実施希望調書!E61=\"\",\"\",【様式２・３】実施希望調書!E61)","v":"2022-06-23"},null,null,null,null,null,null,"都道府県・\n政令指定都市名",null,null,null,null,{"$f":"IF(【様式２・３】実施希望調書!E4=\"\",\"\",【様式２・３】実施希望調書!E4)","v":"北海道"}]
[]
["①派遣先"]
["学校名",null,null,null,{"$f":"IF(【様式２・３】実施希望調書!E7=\"\",\"\",【様式２・３】実施希望調書!E7)","v":"○○市立文化小学校"},null,null,null,null,null,null,null,null,null,null,null,null,null,null,"最寄駅/バス停",null,null,null,"○○駅"]
[]
["②被派遣者",null,null,null,null,null,null,null,null,null,null,null,null,null,null,null,null,null,null,null,null,null,null,null,null,null,null,null,null,"令和",null,3,null,"年",8,null,"月",1,null,"日","現在"]
["ふりがな",null,null,null,"えんそう　たろう",null,null,null,null,null,null,null,null,null,null,"ふりがな",null,null,null,null,null,null,null,null,null,null,null,null,null,null,"生年月日"]
["本名",null,null,null,{"$f":"IF(【様式２・３】実施希望調書!G96=\"\",\"　\",【様式２・３】実施希望調書!G96)","v":"演奏　太郎"},null,null,null,null,null,null,null,null,null,null,"芸名",null,null,null,null,null,null,null,null,null,null,null,null,null,null,"性別"]
["専門分野",null,null,null,"チェロ",null,null,null,null,null,null,null,null,null,null,"所属団体",null,null,null,"●●室内管弦楽団",null,null,null,null,null,null,null,null,null,null,"職業"]
["現住所",null,null,null,"〒","000",null,"-","0000",null,null,null,null,null,null,null,null,null,null,"○○市××町1"]
["最寄交通機関",null,null,null,"△バス○○線",null,null,null,null,null,null,null,null,null,null,"最寄駅/バス停",null,null,null,"D駅前"]
["■専門分野に係る主な賞歴、活動実績など",null,null,null,null,null,null,null,null,null,null,null,null,null,null,null,null,null,null,null,null,null,null,"年",null,null,"月"]
[2010,null,"年",1,null,"月","○○賞入賞",null,null,null,null,null,null,null,null,null,null,null,null,null,null,null,null,"年",null,null,"月"]
[2012,null,"年",2,null,"月","○○賞入賞",null,null,null,null,null,null,null,null,null,null,null,null,null,null,null,null,"年",null,null,"月"]
[null,null,"年",null,null,"月",null,null,null,null,null,null,null,null,null,null,null,null,null,null,null,null,null,"年",null,null,"月"]
[]
["③旅費",null,null,null,"↓（申請時）様式3に転記してください\n　（報告時）様式10に転記してください",null,null,null,null,null,null,null,null,null,null,null,null,null,"※本事業の旅費基準に従って計上してください\n※乗り換え毎に行を分けて記入してください\n※交通機関名欄は、プルダウンより選択してください\n※バス運賃の根拠書類を添付してください（運賃表、検索画面のコピー等）\n※距離を必ず記入してください"]
[]
["旅費合計\n（a+b+c+d)",null,null,null,{"$f":"Z40+AC40+AH40+AK40","v":1000},null,null,null,null,null,null,"円"]
[]
["日付",null,null,null,"曜日",null,"移動区間",null,null,null,null,null,null,"※交通\n機関名",null,null,"※距離\n(㎞)",null,null,"運賃\n乗車券",null,null,"特急\n急行料金",null,null,"交通費\n小計",null,null,"車 賃",null,null,null,null,"日当",null,null,"宿泊費",null,null,"宿泊地"]
[null,null,null,null,null,null,"発地",null,null,"→","着地"]
["2022-06-10",null,null,null,{"$f":"IF(A27=\"\",\"\",A27)","v":44722},null,"D駅前",null,null,"→","○○駅",null,null,"路線バス",null,null,8,null,null,200,null,null,null,null,null,{"$f":"SUM(T27:Y27)","v":200}]
["2022-06-10",null,null,null,44722,null,"○○駅",null,null,"→","D駅前",null,null,"路線バス",null,null,8,null,null,200,null,null,null,null,null,200]
["2022-06-17",null,null,null,44729,null,"D駅前",null,null,"→","○○駅",null,null,"路線バス",null,null,8,null,null,200,null,null,null,null,null,200]
["2022-06-17",null,null,null,44729,null,"○○駅",null,null,"→","D駅前",null,null,"路線バス",null,null,8,null,null,200,null,null,null,null,null,200]
["2022-06-23",null,null,null,44735,null,"D駅前",null,null,"→","○○駅",null,null,"路線バス",null,null,8,null,null,200,null,null,null,null,null,200]
[null,null,null,null,"",null,null,null,null,"→",null,null,null,null,null,null,null,null,null,null,null,null,null,null,null,0]
[null,null,null,null,{"$f":"IF(A33=\"\",\"\",A33)","v":""},null,null,null,null,"→",null,null,null,null,null,null,null,null,null,null,null,null,null,null,null,{"$f":"SUM(T33:Y33)","v":0}]
[null,null,null,null,"",null,null,null,null,"→",null,null,null,null,null,null,null,null,null,null,null,null,null,null,null,0]
[null,null,null,null,"",null,null,null,null,"→",null,null,null,null,null,null,null,null,null,null,null,null,null,null,null,0]
[null,null,null,null,"",null,null,null,null,"→",null,null,null,null,null,null,null,null,null,null,null,null,null,null,null,0]
[null,null,null,null,"",null,null,null,null,"→",null,null,null,null,null,null,null,null,null,null,null,null,null,null,null,0]
[null,null,null,null,"",null,null,null,null,"→",null,null,null,null,null,null,null,null,null,null,null,null,null,null,null,0]
["合　計",null,null,null,null,null,null,null,null,null,null,null,null,null,null,null,null,null,null,null,null,null,null,null,null,"a",null,null,"b",null,null,null,null,"c",null,null,"d"]
[null,null,null,null,null,null,null,null,null,null,null,null,null,null,null,null,null,null,null,null,null,null,null,null,null,{"$f":"SUM(Z27:AB38)","v":1000},null,null,{"$f":"ROUNDDOWN((SUMIFS(Q27:S38,N27:P38,\"自家用車\")),0)*37","v":0},null,null,null,null,{"$f":"SUM(AH27:AJ38)","v":0},null,null,{"$f":"SUM(AK27:AM38)","v":0}]
[]
["(備　考)",null,null,null,null,"※出発地が現住所と異なる場合は出発地（駅名/バス停名）及びその理由を記入してください"]
[]
[]
["※本事業で得た個人情報は、本事業内のみで使用します"]
["※本事業の専用ウェブページにある[個人情報について]に同意していただいたものとします"]

{"sheet":"【様式４】補助者④","index":8,"n_rows":46,"n_cols":41,"rows_kept":46,"cut":false,"hidden":false,"merged":[[0,0,0,2],[0,3,0,41],[1,0,1,41],[2,0,2,41],[3,0,3,41],[4,0,4,3],[4,4,4,5],[4,6,4,11],[4,12,4,13],[4,14,4,19],[7,0,7,3],[7,4,7,18],[7,19,7,22],[7,23,7,29],[7,30,7,41],[8,0,8,41],[4,20,4,21],[4,22,4,27],[4,29,4,33],[4,34,4,41],[5,0,5,41],[6,4,6,41],[10,0,10,3],[10,4,10,14],[10,15,10,18],[10,19,10,29],[10,30,10,33],[10,34,10,41],[9,5,9,28],[9,29,9,30],[9,31,9,32],[9,34,9,35],[9,37,9,38],[9,40,9,41],[12,0,12,3],[12,4,12,14],[12,15,12,18],[12,19,12,29],[12,30,12,33],[12,34,12,41],[11,0,11,3],[11,4,11,14],[11,15,11,18],[11,19,11,29],[11,30,11,33],[11,34,11,41],[13,0,13,3],[13,5,13,6],[13,8,13,10],[13,11,13,18],[13,19,13,41],[14,0,14,3],[14,4,14,14],[14,15,14,18],[14,19,14,29],[14,30,14,41],[17,0,17,1],[17,3,17,4],[17,6,17,20],[17,21,17,22],[17,24,17,25],[17,27,17,41],[15,0,15,20],[15,21,15,22],[15,24,15,25],[15,27,15,41],[16,0,16,1],[16,3,16,4],[16,6,16,20],[16,21,16,22],[16,24,16,25],[16,27,16,41],[19,0,19,41],[20,0,21,3],[22,0,23,3],[22,4,23,10],[22,11,23,12],[22,13,23,13],[18,0,18,1],[18,3,18,4],[18,6,18,20],[18,21,18,22],[18,24,18,25],[18,27,18,41],[20,18,23,41],[20,4,21,17],[24,22,25,24],[24,25,25,27],[24,28,25,32],[24,33,25,35],[24,36,25,38],[24,39,25,41],[24,0,25,3],[24,4,25,5],[24,6,24,12],[24,13,25,15],[24,16,25,18],[24,19,25,21],[25,6,25,8],[25,10,25,12],[26,39,26,41],[27,0,27,3],[27,4,27,5],[27,6,27,8],[27,10,27,12],[27,13,27,15],[27,16,27,18],[27,19,27,21],[27,22,27,24],[27,25,27,27],[26,19,26,21],[26,22,26,24],[26,25,26,27],[26,28,26,32],[26,33,26,35],[26,36,26,38],[26,0,26,3],[26,4,26,5],[26,6,26,8],[26,10,26,12],[26,13,26,15],[26,16,26,18],[27,28,27,32],[27,33,27,35],[27,36,27,38],[27,39,27,41],[28,0,28,3],[28,4,28,5],[28,6,28,8],[28,10,28,12],[28,13,28,15],[28,16,28,18],[28,39,28,41],[28,19,28,21],[28,22,28,24],[28,25,28,27],[28,28,28,32],[28,33,28,35],[28,36,28,38],[29,39,29,41],[30,0,30,3],[30,4,30,5],[30,6,30,8],[30,10,30,12],[30,13,30,15],[30,16,30,18],[30,39,30,41],[30,19,30,21],[30,22,30,24],[30,25,30,27],[30,28,30,32],[30,33,30,35],[30,36,30,38],[29,0,29,3],[29,4,29,5],[29,6,29,8],[29,10,29,12],[29,13,29,15],[29,16,29,18],[29,19,29,21],[29,22,29,24],[29,25,29,27],[31,10,31,12],[31,13,31,15],[31,16,31,18],[31,19,31,21],[31,22,31,24],[31,25,31,27],[29,28,29,32],[29,33,29,35],[29,36,29,38],[33,16,33,18],[33,19,33,21],[33,22,33,24],[33,25,33,27],[31,28,31,32],[31,33,31,35],[31,36,31,38],[31,39,31,41],[32,0,32,3],[32,4,32,5],[32,6,32,8],[32,10,32,12],[32,13,32,15],[32,16,32,18],[32,39,32,41],[32,19,32,21],[32,22,32,24],[32,25,32,27],[32,28,32,32],[32,33,32,35],[32,36,32,38],[31,0,31,3],[31,4,31,5],[31,6,31,8],[35,22,35,24],[35,25,35,27],[33,28,33,32],[33,33,33,35],[33,36,33,38],[33,39,33,41],[34,0,34,3],[34,4,34,5],[34,6,34,8],[34,10,34,12],[34,13,34,15],[34,16,34,18],[34,39,34,41],[34,19,34,21],[34,22,34,24],[34,25,34,27],[34,28,34,32],[34,33,34,35],[34,36,34,38],[33,0,33,3],[33,4,33,5],[33,6,33,8],[33,10,33,12],[33,13,33,15],[35,28,35,32],[35,33,35,35],[35,36,35,38],[35,39,35,41],[36,0,36,3],[36,4,36,5],[36,6,36,8],[36,10,36,12],[36,13,36,15],[36,16,36,18],[36,39,36,41],[36,19,36,21],[36,22,36,24],[36,25,36,27],[36,28,36,32],[36,33,36,35],[36,36,36,38],[35,0,35,3],[35,4,35,5],[35,6,35,8],[35,10,35,12],[35,13,35,15],[35,16,35,18],[35,19,35,21],[37,28,37,32],[37,33,37,35],[37,36,37,38],[37,39,37,41],[38,0,39,24],[38,25,38,27],[38,28,38,32],[38,33,38,35],[38,36,38,38],[38,39,39,41],[37,0,37,3],[37,4,37,5],[37,6,37,8],[37,10,37,12],[37,13,37,15],[37,16,37,18],[37,19,37,21],[37,22,37,24],[37,25,37,27],[42,0,43,41],[44,15,44,41],[45,22,45,41],[39,25,39,27],[39,28,39,32],[39,33,39,35],[39,36,39,38],[40,0,40,41],[41,0,41,3]]}
["様式４"]
["令和4年度文化芸術による子供育成推進事業（芸術家の派遣事業）"]
["被派遣者 略歴書(兼)旅費計算書"]
[]
["実施日",null,null,null,"第1回",null,{"$f":"IF(【様式２・３】実施希望調書!E25=\"\",\"\",【様式２・３】実施希望調書!E25)","v":"2022-06-10"},null,null,null,null,null,"第2回",null,{"$f":"IF(【様式２・３】実施希望調書!E43=\"\",\"\",【様式２・３】実施希望調書!E43)","v":"2022-06-17"},null,null,null,null,null,"第3回",null,{"$f":"IF(【様式２・３】実施希望調書!E61=\"\",\"\",【様式２・３】実施希望調書!E61)","v":"2022-06-23"},null,null,null,null,null,null,"都道府県・\n政令指定都市名",null,null,null,null,{"$f":"IF(【様式２・３】実施希望調書!E4=\"\",\"\",【様式２・３】実施希望調書!E4)","v":"北海道"}]
[]
["①派遣先"]
["学校名",null,null,null,{"$f":"IF(【様式２・３】実施希望調書!E7=\"\",\"\",【様式２・３】実施希望調書!E7)","v":"○○市立文化小学校"},null,null,null,null,null,null,null,null,null,null,null,null,null,null,"最寄駅/バス停",null,null,null,"○○駅"]
[]
["②被派遣者",null,null,null,null,null,null,null,null,null,null,null,null,null,null,null,null,null,null,null,null,null,null,null,null,null,null,null,null,"令和",null,3,null,"年",8,null,"月",1,null,"日","現在"]
["ふりがな",null,null,null,"げんがく　はなこ",null,null,null,null,null,null,null,null,null,null,"ふりがな",null,null,null,null,null,null,null,null,null,null,null,null,null,null,"生年月日"]
["本名",null,null,null,{"$f":"IF(【様式２・３】実施希望調書!G97=\"\",\"　\",【様式２・３】実施希望調書!G97)","v":"弦楽　花子"},null,null,null,null,null,null,null,null,null,null,"芸名",null,null,null,null,null,null,null,null,null,null,null,null,null,null,"性別"]
["専門分野",null,null,null,"コントラバス",null,null,null,null,null,null,null,null,null,null,"所属団体",null,null,null,"●●室内管弦楽団",null,null,null,null,null,null,null,null,null,null,"職業"]
["現住所",null,null,null,"〒","000",null,"-","0000",null,null,null,null,null,null,null,null,null,null,"○○市××町1"]
["最寄交通機関",null,null,null,"JR○○線",null,null,null,null,null,null,null,null,null,null,"最寄駅/バス停",null,null,null,"○○駅"]
["■専門分野に係る主な賞歴、活動実績など",null,null,null,null,null,null,null,null,null,null,null,null,null,null,null,null,null,null,null,null,null,null,"年",null,null,"月"]
[2010,null,"年",1,null,"月","○○賞入賞",null,null,null,null,null,null,null,null,null,null,null,null,null,null,null,null,"年",null,null,"月"]
[2012,null,"年",2,null,"月","○○賞入賞",null,null,null,null,null,null,null,null,null,null,null,null,null,null,null,null,"年",null,null,"月"]
[null,null,"年",null,null,"月",null,null,null,null,null,null,null,null,null,null,null,null,null,null,null,null,null,"年",null,null,"月"]
[]
["③旅費",null,null,null,"↓（申請時）様式3に転記してください\n　（報告時）様式10に転記してください",null,null,null,null,null,null,null,null,null,null,null,null,null,"※本事業の旅費基準に従って計上してください\n※乗り換え毎に行を分けて記入してください\n※交通機関名欄は、プルダウンより選択してください\n※バス運賃の根拠書類を添付してください（運賃表、検索画面のコピー等）\n※距離を必ず記入してください"]
[]
["旅費合計\n（a+b+c+d)",null,null,null,{"$f":"Z40+AC40+AH40+AK40","v":0},null,null,null,null,null,null,"円"]
[]
["日付",null,null,null,"曜日",null,"移動区間",null,null,null,null,null,null,"※交通\n機関名",null,null,"※距離\n(㎞)",null,null,"運賃\n乗車券",null,null,"特急\n急行料金",null,null,"交通費\n小計",null,null,"車 賃",null,null,null,null,"日当",null,null,"宿泊費",null,null,"宿泊地"]
[null,null,null,null,null,null,"発地",null,null,"→","着地"]
["2022-06-23",null,null,null,{"$f":"IF(A27=\"\",\"\",A27)","v":44735},null,"自宅",null,null,"→","学校",null,null,"徒歩",null,null,1,null,null,null,null,null,null,null,null,{"$f":"SUM(T27:Y27)","v":0}]
["2022-06-23",null,null,null,44735,null,"学校",null,null,"→","自宅",null,null,"徒歩",null,null,1,null,null,null,null,null,null,null,null,0]
[null,null,null,null,{"$f":"IF(A29=\"\",\"\",A29)","v":""},null,null,null,null,"→",null,null,null,null,null,null,null,null,null,null,null,null,null,null,null,0]
[null,null,null,null,"",null,null,null,null,"→",null,null,null,null,null,null,null,null,null,null,null,null,null,null,null,0]
[null,null,null,null,"",null,null,null,null,"→",null,null,null,null,null,null,null,null,null,null,null,null,null,null,null,0]
[null,null,null,null,"",null,null,null,null,"→",null,null,null,null,null,null,null,null,null,null,null,null,null,null,null,0]
[null,null,null,null,"",null,null,null,null,"→",null,null,null,null,null,null,null,null,null,null,null,null,null,null,null,0]
[null,null,null,null,"",null,null,null,null,"→",null,null,null,null,null,null,null,null,null,null,null,null,null,null,null,0]
[null,null,null,null,"",null,null,null,null,"→",null,null,null,null,null,null,null,null,null,null,null,null,null,null,null,0]
[null,null,null,null,"",null,null,null,null,"→",null,null,null,null,null,null,null,null,null,null,null,null,null,null,null,0]
[null,null,null,null,"",null,null,null,null,"→",null,null,null,null,null,null,null,null,null,null,null,null,null,null,null,0]
[null,null,null,null,"",null,null,null,null,"→",null,null,null,null,null,null,null,null,null,null,null,null,null,null,null,0]
["合　計",null,null,null,null,null,null,null,null,null,null,null,null,null,null,null,null,null,null,null,null,null,null,null,null,"a",null,null,"b",null,null,null,null,"c",null,null,"d"]
[null,null,null,null,null,null,null,null,null,null,null,null,null,null,null,null,null,null,null,null,null,null,null,null,null,{"$f":"SUM(Z27:AB38)","v":0},null,null,{"$f":"ROUNDDOWN((SUMIFS(Q27:S38,N27:P38,\"自家用車\")),0)*37","v":0},null,null,null,null,{"$f":"SUM(AH27:AJ38)","v":0},null,null,{"$f":"SUM(AK27:AM38)","v":0}]
[]
["(備　考)",null,null,null,null,"※出発地が現住所と異なる場合は出発地（駅名/バス停名）及びその理由を記入してください"]
[]
[]
["※本事業で得た個人情報は、本事業内のみで使用します"]
["※本事業の専用ウェブページにある[個人情報について]に同意していただいたものとします"]

{"sheet":"【様式４】補助者⑤","index":9,"n_rows":46,"n_cols":41,"rows_kept":46,"cut":false,"hidden":false,"merged":[[0,0,0,2],[0,3,0,41],[1,0,1,41],[2,0,2,41],[3,0,3,41],[4,0,4,3],[4,4,4,5],[4,6,4,11],[4,12,4,13],[4,14,4,19],[7,0,7,3],[7,4,7,18],[7,19,7,22],[7,23,7,29],[7,30,7,41],[8,0,8,41],[4,20,4,21],[4,22,4,27],[4,29,4,33],[4,34,4,41],[5,0,5,41],[6,4,6,41],[10,0,10,3],[10,4,10,14],[10,15,10,18],[10,19,10,29],[10,30,10,33],[10,34,10,41],[9,5,9,28],[9,29,9,30],[9,31,9,32],[9,34,9,35],[9,37,9,38],[9,40,9,41],[12,0,12,3],[12,4,12,14],[12,15,12,18],[12,19,12,29],[12,30,12,33],[12,34,12,41],[11,0,11,3],[11,4,11,14],[11,15,11,18],[11,19,11,29],[11,30,11,33],[11,34,11,41],[13,0,13,3],[13,5,13,6],[13,8,13,10],[13,11,13,18],[13,19,13,41],[14,0,14,3],[14,4,14,14],[14,15,14,18],[14,19,14,29],[14,30,14,41],[17,0,17,1],[17,3,17,4],[17,6,17,20],[17,21,17,22],[17,24,17,25],[17,27,17,41],[15,0,15,20],[15,21,15,22],[15,24,15,25],[15,27,15,41],[16,0,16,1],[16,3,16,4],[16,6,16,20],[16,21,16,22],[16,24,16,25],[16,27,16,41],[19,0,19,41],[20,0,21,3],[22,0,23,3],[22,4,23,10],[22,11,23,12],[22,13,23,13],[18,0,18,1],[18,3,18,4],[18,6,18,20],[18,21,18,22],[18,24,18,25],[18,27,18,41],[20,18,23,41],[20,4,21,17],[24,22,25,24],[24,25,25,27],[24,28,25,32],[24,33,25,35],[24,36,25,38],[24,39,25,41],[24,0,25,3],[24,4,25,5],[24,6,24,12],[24,13,25,15],[24,16,25,18],[24,19,25,21],[25,6,25,8],[25,10,25,12],[26,39,26,41],[27,0,27,3],[27,4,27,5],[27,6,27,8],[27,10,27,12],[27,13,27,15],[27,16,27,18],[27,19,27,21],[27,22,27,24],[27,25,27,27],[26,19,26,21],[26,22,26,24],[26,25,26,27],[26,28,26,32],[26,33,26,35],[26,36,26,38],[26,0,26,3],[26,4,26,5],[26,6,26,8],[26,10,26,12],[26,13,26,15],[26,16,26,18],[27,28,27,32],[27,33,27,35],[27,36,27,38],[27,39,27,41],[28,0,28,3],[28,4,28,5],[28,6,28,8],[28,10,28,12],[28,13,28,15],[28,16,28,18],[28,39,28,41],[28,19,28,21],[28,22,28,24],[28,25,28,27],[28,28,28,32],[28,33,28,35],[28,36,28,38],[29,39,29,41],[30,0,30,3],[30,4,30,5],[30,6,30,8],[30,10,30,12],[30,13,30,15],[30,16,30,18],[30,39,30,41],[30,19,30,21],[30,22,30,24],[30,25,30,27],[30,28,30,32],[30,33,30,35],[30,36,30,38],[29,0,29,3],[29,4,29,5],[29,6,29,8],[29,10,29,12],[29,13,29,15],[29,16,29,18],[29,19,29,21],[29,22,29,24],[29,25,29,27],[31,10,31,12],[31,13,31,15],[31,16,31,18],[31,19,31,21],[31,22,31,24],[31,25,31,27],[29,28,29,32],[29,33,29,35],[29,36,29,38],[33,16,33,18],[33,19,33,21],[33,22,33,24],[33,25,33,27],[31,28,31,32],[31,33,31,35],[31,36,31,38],[31,39,31,41],[32,0,32,3],[32,4,32,5],[32,6,32,8],[32,10,32,12],[32,13,32,15],[32,16,32,18],[32,39,32,41],[32,19,32,21],[32,22,32,24],[32,25,32,27],[32,28,32,32],[32,33,32,35],[32,36,32,38],[31,0,31,3],[31,4,31,5],[31,6,31,8],[35,22,35,24],[35,25,35,27],[33,28,33,32],[33,33,33,35],[33,36,33,38],[33,39,33,41],[34,0,34,3],[34,4,34,5],[34,6,34,8],[34,10,34,12],[34,13,34,15],[34,16,34,18],[34,39,34,41],[34,19,34,21],[34,22,34,24],[34,25,34,27],[34,28,34,32],[34,33,34,35],[34,36,34,38],[33,0,33,3],[33,4,33,5],[33,6,33,8],[33,10,33,12],[33,13,33,15],[35,28,35,32],[35,33,35,35],[35,36,35,38],[35,39,35,41],[36,0,36,3],[36,4,36,5],[36,6,36,8],[36,10,36,12],[36,13,36,15],[36,16,36,18],[36,39,36,41],[36,19,36,21],[36,22,36,24],[36,25,36,27],[36,28,36,32],[36,33,36,35],[36,36,36,38],[35,0,35,3],[35,4,35,5],[35,6,35,8],[35,10,35,12],[35,13,35,15],[35,16,35,18],[35,19,35,21],[37,28,37,32],[37,33,37,35],[37,36,37,38],[37,39,37,41],[38,0,39,24],[38,25,38,27],[38,28,38,32],[38,33,38,35],[38,36,38,38],[38,39,39,41],[37,0,37,3],[37,4,37,5],[37,6,37,8],[37,10,37,12],[37,13,37,15],[37,16,37,18],[37,19,37,21],[37,22,37,24],[37,25,37,27],[42,0,43,41],[44,15,44,41],[45,22,45,41],[39,25,39,27],[39,28,39,32],[39,33,39,35],[39,36,39,38],[40,0,40,41],[41,0,41,3]]}
["様式４"]
["令和4年度文化芸術による子供育成推進事業（芸術家の派遣事業）"]
["被派遣者 略歴書(兼)旅費計算書"]
[]
["実施日",null,null,null,"第1回",null,{"$f":"IF(【様式２・３】実施希望調書!E25=\"\",\"\",【様式２・３】実施希望調書!E25)","v":"2022-06-10"},null,null,null,null,null,"第2回",null,{"$f":"IF(【様式２・３】実施希望調書!E43=\"\",\"\",【様式２・３】実施希望調書!E43)","v":"2022-06-17"},null,null,null,null,null,"第3回",null,{"$f":"IF(【様式２・３】実施希望調書!E61=\"\",\"\",【様式２・３】実施希望調書!E61)","v":"2022-06-23"},null,null,null,null,null,null,"都道府県・\n政令指定都市名",null,null,null,null,{"$f":"IF(【様式２・３】実施希望調書!E4=\"\",\"\",【様式２・３】実施希望調書!E4)","v":"北海道"}]
[]
["①派遣先"]
["学校名",null,null,null,{"$f":"IF(【様式２・３】実施希望調書!E7=\"\",\"\",【様式２・３】実施希望調書!E7)","v":"○○市立文化小学校"},null,null,null,null,null,null,null,null,null,null,null,null,null,null,"最寄駅/バス停",null,null,null,"○○駅"]
[]
["②被派遣者",null,null,null,null,null,null,null,null,null,null,null,null,null,null,null,null,null,null,null,null,null,null,null,null,null,null,null,null,"令和",null,3,null,"年",8,null,"月",1,null,"日","現在"]
["ふりがな",null,null,null,"けんばん　たろう",null,null,null,null,null,null,null,null,null,null,"ふりがな",null,null,null,null,null,null,null,null,null,null,null,null,null,null,"生年月日"]
["本名",null,null,null,{"$f":"IF(【様式２・３】実施希望調書!G98=\"\",\"　\",【様式２・３】実施希望調書!G98)","v":"鍵盤　太郎"},null,null,null,null,null,null,null,null,null,null,"芸名",null,null,null,null,null,null,null,null,null,null,null,null,null,null,"性別"]
["専門分野",null,null,null,"ピアノ",null,null,null,null,null,null,null,null,null,null,"所属団体",null,null,null,"●●室内管弦楽団",null,null,null,null,null,null,null,null,null,null,"職業"]
["現住所",null,null,null,"〒","000",null,"-","0000",null,null,null,null,null,null,null,null,null,null,"○○市××町1"]
["最寄交通機関",null,null,null,"JR○○線",null,null,null,null,null,null,null,null,null,null,"最寄駅/バス停",null,null,null,"B駅"]
["■専門分野に係る主な賞歴、活動実績など",null,null,null,null,null,null,null,null,null,null,null,null,null,null,null,null,null,null,null,null,null,null,"年",null,null,"月"]
[2010,null,"年",1,null,"月","○○賞入賞",null,null,null,null,null,null,null,null,null,null,null,null,null,null,null,null,"年",null,null,"月"]
[2012,null,"年",2,null,"月","○○賞入賞",null,null,null,null,null,null,null,null,null,null,null,null,null,null,null,null,"年",null,null,"月"]
[null,null,"年",null,null,"月",null,null,null,null,null,null,null,null,null,null,null,null,null,null,null,null,null,"年",null,null,"月"]
[]
["③旅費",null,null,null,"↓（申請時）様式3に転記してください\n　（報告時）様式10に転記してください",null,null,null,null,null,null,null,null,null,null,null,null,null,"※本事業の旅費基準に従って計上してください\n※乗り換え毎に行を分けて記入してください\n※交通機関名欄は、プルダウンより選択してください\n※バス運賃の根拠書類を添付してください（運賃表、検索画面のコピー等）\n※距離を必ず記入してください"]
[]
["旅費合計\n（a+b+c+d)",null,null,null,{"$f":"Z40+AC40+AH40+AK40","v":2210},null,null,null,null,null,null,"円"]
[]
["日付",null,null,null,"曜日",null,"移動区間",null,null,null,null,null,null,"※交通\n機関名",null,null,"※距離\n(㎞)",null,null,"運賃\n乗車券",null,null,"特急\n急行料金",null,null,"交通費\n小計",null,null,"車 賃",null,null,null,null,"日当",null,null,"宿泊費",null,null,"宿泊地"]
[null,null,null,null,null,null,"発地",null,null,"→","着地"]
["2022-06-23",null,null,null,{"$f":"IF(A27=\"\",\"\",A27)","v":44735},null,"自宅",null,null,"→","学校",null,null,"自家用車",null,null,15,null,null,null,null,null,null,null,null,{"$f":"SUM(T27:Y27)","v":0},null,null,null,null,null,null,null,1100]
["2022-06-23",null,null,null,44735,null,"学校",null,null,"→","自宅",null,null,"自家用車",null,null,15,null,null,null,null,null,null,null,null,0]
[null,null,null,null,{"$f":"IF(A29=\"\",\"\",A29)","v":""},null,null,null,null,"→",null,null,null,null,null,null,null,null,null,null,null,null,null,null,null,0]
[null,null,null,null,"",null,null,null,null,"→",null,null,null,null,null,null,null,null,null,null,null,null,null,null,null,0]
[null,null,null,null,"",null,null,null,null,"→",null,null,null,null,null,null,null,null,null,null,null,null,null,null,null,0]
[null,null,null,null,"",null,null,null,null,"→",null,null,null,null,null,null,null,null,null,null,null,null,null,null,null,0]
[null,null,null,null,"",null,null,null,null,"→",null,null,null,null,null,null,null,null,null,null,null,null,null,null,null,0]
[null,null,null,null,"",null,null,null,null,"→",null,null,null,null,null,null,null,null,null,null,null,null,null,null,null,0]
[null,null,null,null,"",null,null,null,null,"→",null,null,null,null,null,null,null,null,null,null,null,null,null,null,null,0]
[null,null,null,null,"",null,null,null,null,"→",null,null,null,null,null,null,null,null,null,null,null,null,null,null,null,0]
[null,null,null,null,"",null,null,null,null,"→",null,null,null,null,null,null,null,null,null,null,null,null,null,null,null,0]
[null,null,null,null,"",null,null,null,null,"→",null,null,null,null,null,null,null,null,null,null,null,null,null,null,null,0]
["合　計",null,null,null,null,null,null,null,null,null,null,null,null,null,null,null,null,null,null,null,null,null,null,null,null,"a",null,null,"b",null,null,null,null,"c",null,null,"d"]
[null,null,null,null,null,null,null,null,null,null,null,null,null,null,null,null,null,null,null,null,null,null,null,null,null,{"$f":"SUM(Z27:AB38)","v":0},null,null,{"$f":"ROUNDDOWN((SUMIFS(Q27:S38,N27:P38,\"自家用車\")),0)*37","v":1110},null,null,null,null,{"$f":"SUM(AH27:AJ38)","v":1100},null,null,{"$f":"SUM(AK27:AM38)","v":0}]
[]
["(備　考)",null,null,null,null,"※出発地が現住所と異なる場合は出発地（駅名/バス停名）及びその理由を記入してください"]
[]
[]
["※本事業で得た個人情報は、本事業内のみで使用します"]
["※本事業の専用ウェブページにある[個人情報について]に同意していただいたものとします"]

{"sheet":"【様式４】補助者⑥","index":10,"n_rows":46,"n_cols":41,"rows_kept":46,"cut":false,"hidden":false,"merged":[[0,0,0,2],[0,3,0,41],[1,0,1,41],[2,0,2,41],[3,0,3,41],[4,0,4,3],[4,4,4,5],[4,6,4,11],[4,12,4,13],[4,14,4,19],[7,0,7,3],[7,4,7,18],[7,19,7,22],[7,23,7,29],[7,30,7,41],[8,0,8,41],[4,20,4,21],[4,22,4,27],[4,29,4,33],[4,34,4,41],[5,0,5,41],[6,4,6,41],[10,0,10,3],[10,4,10,14],[10,15,10,18],[10,19,10,29],[10,30,10,33],[10,34,10,41],[9,5,9,28],[9,29,9,30],[9,31,9,32],[9,34,9,35],[9,37,9,38],[9,40,9,41],[12,0,12,3],[12,4,12,14],[12,15,12,18],[12,19,12,29],[12,30,12,33],[12,34,12,41],[11,0,11,3],[11,4,11,14],[11,15,11,18],[11,19,11,29],[11,30,11,33],[11,34,11,41],[13,0,13,3],[13,5,13,6],[13,8,13,10],[13,11,13,18],[13,19,13,41],[14,0,14,3],[14,4,14,14],[14,15,14,18],[14,19,14,29],[14,30,14,41],[17,0,17,1],[17,3,17,4],[17,6,17,20],[17,21,17,22],[17,24,17,25],[17,27,17,41],[15,0,15,20],[15,21,15,22],[15,24,15,25],[15,27,15,41],[16,0,16,1],[16,3,16,4],[16,6,16,20],[16,21,16,22],[16,24,16,25],[16,27,16,41],[19,0,19,41],[20,0,21,3],[22,0,23,3],[22,4,23,10],[22,11,23,12],[22,13,23,13],[18,0,18,1],[18,3,18,4],[18,6,18,20],[18,21,18,22],[18,24,18,25],[18,27,18,41],[20,18,23,41],[20,4,21,17],[24,22,25,24],[24,25,25,27],[24,28,25,32],[24,33,25,35],[24,36,25,38],[24,39,25,41],[24,0,25,3],[24,4,25,5],[24,6,24,12],[24,13,25,15],[24,16,25,18],[24,19,25,21],[25,6,25,8],[25,10,25,12],[26,39,26,41],[27,0,27,3],[27,4,27,5],[27,6,27,8],[27,10,27,12],[27,13,27,15],[27,16,27,18],[27,19,27,21],[27,22,27,24],[27,25,27,27],[26,19,26,21],[26,22,26,24],[26,25,26,27],[26,28,26,32],[26,33,26,35],[26,36,26,38],[26,0,26,3],[26,4,26,5],[26,6,26,8],[26,10,26,12],[26,13,26,15],[26,16,26,18],[27,28,27,32],[27,33,27,35],[27,36,27,38],[27,39,27,41],[28,0,28,3],[28,4,28,5],[28,6,28,8],[28,10,28,12],[28,13,28,15],[28,16,28,18],[28,39,28,41],[28,19,28,21],[28,22,28,24],[28,25,28,27],[28,28,28,32],[28,33,28,35],[28,36,28,38],[29,39,29,41],[30,0,30,3],[30,4,30,5],[30,6,30,8],[30,10,30,12],[30,13,30,15],[30,16,30,18],[30,39,30,41],[30,19,30,21],[30,22,30,24],[30,25,30,27],[30,28,30,32],[30,33,30,35],[30,36,30,38],[29,0,29,3],[29,4,29,5],[29,6,29,8],[29,10,29,12],[29,13,29,15],[29,16,29,18],[29,19,29,21],[29,22,29,24],[29,25,29,27],[31,10,31,12],[31,13,31,15],[31,16,31,18],[31,19,31,21],[31,22,31,24],[31,25,31,27],[29,28,29,32],[29,33,29,35],[29,36,29,38],[33,16,33,18],[33,19,33,21],[33,22,33,24],[33,25,33,27],[31,28,31,32],[31,33,31,35],[31,36,31,38],[31,39,31,41],[32,0,32,3],[32,4,32,5],[32,6,32,8],[32,10,32,12],[32,13,32,15],[32,16,32,18],[32,39,32,41],[32,19,32,21],[32,22,32,24],[32,25,32,27],[32,28,32,32],[32,33,32,35],[32,36,32,38],[31,0,31,3],[31,4,31,5],[31,6,31,8],[35,22,35,24],[35,25,35,27],[33,28,33,32],[33,33,33,35],[33,36,33,38],[33,39,33,41],[34,0,34,3],[34,4,34,5],[34,6,34,8],[34,10,34,12],[34,13,34,15],[34,16,34,18],[34,39,34,41],[34,19,34,21],[34,22,34,24],[34,25,34,27],[34,28,34,32],[34,33,34,35],[34,36,34,38],[33,0,33,3],[33,4,33,5],[33,6,33,8],[33,10,33,12],[33,13,33,15],[35,28,35,32],[35,33,35,35],[35,36,35,38],[35,39,35,41],[36,0,36,3],[36,4,36,5],[36,6,36,8],[36,10,36,12],[36,13,36,15],[36,16,36,18],[36,39,36,41],[36,19,36,21],[36,22,36,24],[36,25,36,27],[36,28,36,32],[36,33,36,35],[36,36,36,38],[35,0,35,3],[35,4,35,5],[35,6,35,8],[35,10,35,12],[35,13,35,15],[35,16,35,18],[35,19,35,21],[37,28,37,32],[37,33,37,35],[37,36,37,38],[37,39,37,41],[38,0,39,24],[38,25,38,27],[38,28,38,32],[38,33,38,35],[38,36,38,38],[38,39,39,41],[37,0,37,3],[37,4,37,5],[37,6,37,8],[37,10,37,12],[37,13,37,15],[37,16,37,18],[37,19,37,21],[37,22,37,24],[37,25,37,27],[42,0,43,41],[44,15,44,41],[45,22,45,41],[39,25,39,27],[39,28,39,32],[39,33,39,35],[39,36,39,38],[40,0,40,41],[41,0,41,3]]}
["様式４"]
["令和4年度文化芸術による子供育成推進事業（芸術家の派遣事業）"]
["被派遣者 略歴書(兼)旅費計算書"]
[]
["実施日",null,null,null,"第1回",null,{"$f":"IF(【様式２・３】実施希望調書!E25=\"\",\"\",【様式２・３】実施希望調書!E25)","v":"2022-06-10"},null,null,null,null,null,"第2回",null,{"$f":"IF(【様式２・３】実施希望調書!E43=\"\",\"\",【様式２・３】実施希望調書!E43)","v":"2022-06-17"},null,null,null,null,null,"第3回",null,{"$f":"IF(【様式２・３】実施希望調書!E61=\"\",\"\",【様式２・３】実施希望調書!E61)","v":"2022-06-23"},null,null,null,null,null,null,"都道府県・\n政令指定都市名",null,null,null,null,{"$f":"IF(【様式２・３】実施希望調書!E4=\"\",\"\",【様式２・３】実施希望調書!E4)","v":"北海道"}]
[]
["①派遣先"]
["学校名",null,null,null,{"$f":"IF(【様式２・３】実施希望調書!E7=\"\",\"\",【様式２・３】実施希望調書!E7)","v":"○○市立文化小学校"},null,null,null,null,null,null,null,null,null,null,null,null,null,null,"最寄駅/バス停"]
[]
["②被派遣者",null,null,null,null,null,null,null,null,null,null,null,null,null,null,null,null,null,null,null,null,null,null,null,null,null,null,null,null,"令和",null,null,null,"年",null,null,"月",null,null,"日","現在"]
["ふりがな",null,null,null,null,null,null,null,null,null,null,null,null,null,null,"ふりがな",null,null,null,null,null,null,null,null,null,null,null,null,null,null,"生年月日"]
["本名",null,null,null,{"$f":"IF(【様式２・３】実施希望調書!G99=\"\",\"　\",【様式２・３】実施希望調書!G99)","v":"　"},null,null,null,null,null,null,null,null,null,null,"芸名",null,null,null,null,null,null,null,null,null,null,null,null,null,null,"性別"]
["専門分野",null,null,null,null,null,null,null,null,null,null,null,null,null,null,"所属団体",null,null,null,null,null,null,null,null,null,null,null,null,null,null,"職業"]
["現住所",null,null,null,"〒",null,null,"-"]
["最寄交通機関",null,null,null,null,null,null,null,null,null,null,null,null,null,null,"最寄駅/バス停"]
["■専門分野に係る主な賞歴、活動実績など",null,null,null,null,null,null,null,null,null,null,null,null,null,null,null,null,null,null,null,null,null,null,"年",null,null,"月"]
[null,null,"年",null,null,"月",null,null,null,null,null,null,null,null,null,null,null,null,null,null,null,null,null,"年",null,null,"月"]
[null,null,"年",null,null,"月",null,null,null,null,null,null,null,null,null,null,null,null,null,null,null,null,null,"年",null,null,"月"]
[null,null,"年",null,null,"月",null,null,null,null,null,null,null,null,null,null,null,null,null,null,null,null,null,"年",null,null,"月"]
[]
["③旅費",null,null,null,"↓（申請時）様式3に転記してください\n　（報告時）様式10に転記してください",null,null,null,null,null,null,null,null,null,null,null,null,null,"※本事業の旅費基準に従って計上してください\n※乗り換え毎に行を分けて記入してください\n※交通機関名欄は、プルダウンより選択してください\n※バス運賃の根拠書類を添付してください（運賃表、検索画面のコピー等）\n※距離を必ず記入してください"]
[]
["旅費合計\n（a+b+c+d)",null,null,null,{"$f":"Z40+AC40+AH40+AK40","v":0},null,null,null,null,null,null,"円"]
[]
["日付",null,null,null,"曜日",null,"移動区間",null,null,null,null,null,null,"※交通\n機関名",null,null,"※距離\n(㎞)",null,null,"運賃\n乗車券",null,null,"特急\n急行料金",null,null,"交通費\n小計",null,null,"車 賃",null,null,null,null,"日当",null,null,"宿泊費",null,null,"宿泊地"]
[null,null,null,null,null,null,"発地",null,null,"→","着地"]
[null,null,null,null,{"$f":"IF(A27=\"\",\"\",A27)","v":""},null,null,null,null,"→",null,null,null,null,null,null,null,null,null,null,null,null,null,null,null,{"$f":"SUM(T27:Y27)","v":0}]
[null,null,null,null,"",null,null,null,null,"→",null,null,null,null,null,null,null,null,null,null,null,null,null,null,null,0]
[null,null,null,null,"",null,null,null,null,"→",null,null,null,null,null,null,null,null,null,null,null,null,null,null,null,0]
[null,null,null,null,"",null,null,null,null,"→",null,null,null,null,null,null,null,null,null,null,null,null,null,null,null,0]
[null,null,null,null,"",null,null,null,null,"→",null,null,null,null,null,null,null,null,null,null,null,null,null,null,null,0]
[null,null,null,null,"",null,null,null,null,"→",null,null,null,null,null,null,null,null,null,null,null,null,null,null,null,0]
[null,null,null,null,"",null,null,null,null,"→",null,null,null,null,null,null,null,null,null,null,null,null,null,null,null,0]
[null,null,null,null,"",null,null,null,null,"→",null,null,null,null,null,null,null,null,null,null,null,null,null,null,null,0]
[null,null,null,null,"",null,null,null,null,"→",null,null,null,null,null,null,null,null,null,null,null,null,null,null,null,0]
[null,null,null,null,"",null,null,null,null,"→",null,null,null,null,null,null,null,null,null,null,null,null,null,null,null,0]
[null,null,null,null,"",null,null,null,null,"→",null,null,null,null,null,null,null,null,null,null,null,null,null,null,null,0]
[null,null,null,null,"",null,null,null,null,"→",null,null,null,null,null,null,null,null,null,null,null,null,null,null,null,0]
["合　計",null,null,null,null,null,null,null,null,null,null,null,null,null,null,null,null,null,null,null,null,null,null,null,null,"a",null,null,"b",null,null,null,null,"c",null,null,"d"]
[null,null,null,null,null,null,null,null,null,null,null,null,null,null,null,null,null,null,null,null,null,null,null,null,null,{"$f":"SUM(Z27:AB38)","v":0},null,null,{"$f":"ROUNDDOWN((SUMIFS(Q27:S38,N27:P38,\"自家用車\")),0)*37","v":0},null,null,null,null,{"$f":"SUM(AH27:AJ38)","v":0},null,null,{"$f":"SUM(AK27:AM38)","v":0}]
[]
["(備　考)",null,null,null,null,"※出発地が現住所と異なる場合は出発地（駅名/バス停名）及びその理由を記入してください"]
[]
[]
["※本事業で得た個人情報は、本事業内のみで使用します"]
["※本事業の専用ウェブページにある[個人情報について]に同意していただいたものとします"]

{"sheet":"【様式４】補助者⑦","index":11,"n_rows":46,"n_cols":41,"rows_kept":46,"cut":false,"hidden":false,"merged":[[0,0,0,2],[0,3,0,41],[1,0,1,41],[2,0,2,41],[3,0,3,41],[4,0,4,3],[4,4,4,5],[4,6,4,11],[4,12,4,13],[4,14,4,19],[7,0,7,3],[7,4,7,18],[7,19,7,22],[7,23,7,29],[7,30,7,41],[8,0,8,41],[4,20,4,21],[4,22,4,27],[4,29,4,33],[4,34,4,41],[5,0,5,41],[6,4,6,41],[10,0,10,3],[10,4,10,14],[10,15,10,18],[10,19,10,29],[10,30,10,33],[10,34,10,41],[9,5,9,28],[9,29,9,30],[9,31,9,32],[9,34,9,35],[9,37,9,38],[9,40,9,41],[12,0,12,3],[12,4,12,14],[12,15,12,18],[12,19,12,29],[12,30,12,33],[12,34,12,41],[11,0,11,3],[11,4,11,14],[11,15,11,18],[11,19,11,29],[11,30,11,33],[11,34,11,41],[13,0,13,3],[13,5,13,6],[13,8,13,10],[13,11,13,18],[13,19,13,41],[14,0,14,3],[14,4,14,14],[14,15,14,18],[14,19,14,29],[14,30,14,41],[17,0,17,1],[17,3,17,4],[17,6,17,20],[17,21,17,22],[17,24,17,25],[17,27,17,41],[15,0,15,20],[15,21,15,22],[15,24,15,25],[15,27,15,41],[16,0,16,1],[16,3,16,4],[16,6,16,20],[16,21,16,22],[16,24,16,25],[16,27,16,41],[19,0,19,41],[20,0,21,3],[22,0,23,3],[22,4,23,10],[22,11,23,12],[22,13,23,13],[18,0,18,1],[18,3,18,4],[18,6,18,20],[18,21,18,22],[18,24,18,25],[18,27,18,41],[20,18,23,41],[20,4,21,17],[24,22,25,24],[24,25,25,27],[24,28,25,32],[24,33,25,35],[24,36,25,38],[24,39,25,41],[24,0,25,3],[24,4,25,5],[24,6,24,12],[24,13,25,15],[24,16,25,18],[24,19,25,21],[25,6,25,8],[25,10,25,12],[26,39,26,41],[27,0,27,3],[27,4,27,5],[27,6,27,8],[27,10,27,12],[27,13,27,15],[27,16,27,18],[27,19,27,21],[27,22,27,24],[27,25,27,27],[26,19,26,21],[26,22,26,24],[26,25,26,27],[26,28,26,32],[26,33,26,35],[26,36,26,38],[26,0,26,3],[26,4,26,5],[26,6,26,8],[26,10,26,12],[26,13,26,15],[26,16,26,18],[27,28,27,32],[27,33,27,35],[27,36,27,38],[27,39,27,41],[28,0,28,3],[28,4,28,5],[28,6,28,8],[28,10,28,12],[28,13,28,15],[28,16,28,18],[28,39,28,41],[28,19,28,21],[28,22,28,24],[28,25,28,27],[28,28,28,32],[28,33,28,35],[28,36,28,38],[29,39,29,41],[30,0,30,3],[30,4,30,5],[30,6,30,8],[30,10,30,12],[30,13,30,15],[30,16,30,18],[30,39,30,41],[30,19,30,21],[30,22,30,24],[30,25,30,27],[30,28,30,32],[30,33,30,35],[30,36,30,38],[29,0,29,3],[29,4,29,5],[29,6,29,8],[29,10,29,12],[29,13,29,15],[29,16,29,18],[29,19,29,21],[29,22,29,24],[29,25,29,27],[31,10,31,12],[31,13,31,15],[31,16,31,18],[31,19,31,21],[31,22,31,24],[31,25,31,27],[29,28,29,32],[29,33,29,35],[29,36,29,38],[33,16,33,18],[33,19,33,21],[33,22,33,24],[33,25,33,27],[31,28,31,32],[31,33,31,35],[31,36,31,38],[31,39,31,41],[32,0,32,3],[32,4,32,5],[32,6,32,8],[32,10,32,12],[32,13,32,15],[32,16,32,18],[32,39,32,41],[32,19,32,21],[32,22,32,24],[32,25,32,27],[32,28,32,32],[32,33,32,35],[32,36,32,38],[31,0,31,3],[31,4,31,5],[31,6,31,8],[35,22,35,24],[35,25,35,27],[33,28,33,32],[33,33,33,35],[33,36,33,38],[33,39,33,41],[34,0,34,3],[34,4,34,5],[34,6,34,8],[34,10,34,12],[34,13,34,15],[34,16,34,18],[34,39,34,41],[34,19,34,21],[34,22,34,24],[34,25,34,27],[34,28,34,32],[34,33,34,35],[34,36,34,38],[33,0,33,3],[33,4,33,5],[33,6,33,8],[33,10,33,12],[33,13,33,15],[35,28,35,32],[35,33,35,35],[35,36,35,38],[35,39,35,41],[36,0,36,3],[36,4,36,5],[36,6,36,8],[36,10,36,12],[36,13,36,15],[36,16,36,18],[36,39,36,41],[36,19,36,21],[36,22,36,24],[36,25,36,27],[36,28,36,32],[36,33,36,35],[36,36,36,38],[35,0,35,3],[35,4,35,5],[35,6,35,8],[35,10,35,12],[35,13,35,15],[35,16,35,18],[35,19,35,21],[37,28,37,32],[37,33,37,35],[37,36,37,38],[37,39,37,41],[38,0,39,24],[38,25,38,27],[38,28,38,32],[38,33,38,35],[38,36,38,38],[38,39,39,41],[37,0,37,3],[37,4,37,5],[37,6,37,8],[37,10,37,12],[37,13,37,15],[37,16,37,18],[37,19,37,21],[37,22,37,24],[37,25,37,27],[42,0,43,41],[44,15,44,41],[45,22,45,41],[39,25,39,27],[39,28,39,32],[39,33,39,35],[39,36,39,38],[40,0,40,41],[41,0,41,3]]}
["様式４"]
["令和4年度文化芸術による子供育成推進事業（芸術家の派遣事業）"]
["被派遣者 略歴書(兼)旅費計算書"]
[]
["実施日",null,null,null,"第1回",null,{"$f":"IF(【様式２・３】実施希望調書!E25=\"\",\"\",【様式２・３】実施希望調書!E25)","v":"2022-06-10"},null,null,null,null,null,"第2回",null,{"$f":"IF(【様式２・３】実施希望調書!E43=\"\",\"\",【様式２・３】実施希望調書!E43)","v":"2022-06-17"},null,null,null,null,null,"第3回",null,{"$f":"IF(【様式２・３】実施希望調書!E61=\"\",\"\",【様式２・３】実施希望調書!E61)","v":"2022-06-23"},null,null,null,null,null,null,"都道府県・\n政令指定都市名",null,null,null,null,{"$f":"IF(【様式２・３】実施希望調書!E4=\"\",\"\",【様式２・３】実施希望調書!E4)","v":"北海道"}]
[]
["①派遣先"]
["学校名",null,null,null,{"$f":"IF(【様式２・３】実施希望調書!E7=\"\",\"\",【様式２・３】実施希望調書!E7)","v":"○○市立文化小学校"},null,null,null,null,null,null,null,null,null,null,null,null,null,null,"最寄駅/バス停"]
[]
["②被派遣者",null,null,null,null,null,null,null,null,null,null,null,null,null,null,null,null,null,null,null,null,null,null,null,null,null,null,null,null,"令和",null,null,null,"年",null,null,"月",null,null,"日","現在"]
["ふりがな",null,null,null,null,null,null,null,null,null,null,null,null,null,null,"ふりがな",null,null,null,null,null,null,null,null,null,null,null,null,null,null,"生年月日"]
["本名",null,null,null,{"$f":"IF(【様式２・３】実施希望調書!G100=\"\",\"　\",【様式２・３】実施希望調書!G100)","v":"　"},null,null,null,null,null,null,null,null,null,null,"芸名",null,null,null,null,null,null,null,null,null,null,null,null,null,null,"性別"]
["専門分野",null,null,null,null,null,null,null,null,null,null,null,null,null,null,"所属団体",null,null,null,null,null,null,null,null,null,null,null,null,null,null,"職業"]
["現住所",null,null,null,"〒",null,null,"-"]
["最寄交通機関",null,null,null,null,null,null,null,null,null,null,null,null,null,null,"最寄駅/バス停"]
["■専門分野に係る主な賞歴、活動実績など",null,null,null,null,null,null,null,null,null,null,null,null,null,null,null,null,null,null,null,null,null,null,"年",null,null,"月"]
[null,null,"年",null,null,"月",null,null,null,null,null,null,null,null,null,null,null,null,null,null,null,null,null,"年",null,null,"月"]
[null,null,"年",null,null,"月",null,null,null,null,null,null,null,null,null,null,null,null,null,null,null,null,null,"年",null,null,"月"]
[null,null,"年",null,null,"月",null,null,null,null,null,null,null,null,null,null,null,null,null,null,null,null,null,"年",null,null,"月"]
[]
["③旅費",null,null,null,"↓（申請時）様式3に転記してください\n　（報告時）様式10に転記してください",null,null,null,null,null,null,null,null,null,null,null,null,null,"※本事業の旅費基準に従って計上してください\n※乗り換え毎に行を分けて記入してください\n※交通機関名欄は、プルダウンより選択してください\n※バス運賃の根拠書類を添付してください（運賃表、検索画面のコピー等）\n※距離を必ず記入してください"]
[]
["旅費合計\n（a+b+c+d)",null,null,null,{"$f":"Z40+AC40+AH40+AK40","v":0},null,null,null,null,null,null,"円"]
[]
["日付",null,null,null,"曜日",null,"移動区間",null,null,null,null,null,null,"※交通\n機関名",null,null,"※距離\n(㎞)",null,null,"運賃\n乗車券",null,null,"特急\n急行料金",null,null,"交通費\n小計",null,null,"車 賃",null,null,null,null,"日当",null,null,"宿泊費",null,null,"宿泊地"]
[null,null,null,null,null,null,"発地",null,null,"→","着地"]
[null,null,null,null,{"$f":"IF(A27=\"\",\"\",A27)","v":""},null,null,null,null,"→",null,null,null,null,null,null,null,null,null,null,null,null,null,null,null,{"$f":"SUM(T27:Y27)","v":0}]
[null,null,null,null,"",null,null,null,null,"→",null,null,null,null,null,null,null,null,null,null,null,null,null,null,null,0]
[null,null,null,null,"",null,null,null,null,"→",null,null,null,null,null,null,null,null,null,null,null,null,null,null,null,0]
[null,null,null,null,"",null,null,null,null,"→",null,null,null,null,null,null,null,null,null,null,null,null,null,null,null,0]
[null,null,null,null,"",null,null,null,null,"→",null,null,null,null,null,null,null,null,null,null,null,null,null,null,null,0]
[null,null,null,null,"",null,null,null,null,"→",null,null,null,null,null,null,null,null,null,null,null,null,null,null,null,0]
[null,null,null,null,"",null,null,null,null,"→",null,null,null,null,null,null,null,null,null,null,null,null,null,null,null,0]
[null,null,null,null,"",null,null,null,null,"→",null,null,null,null,null,null,null,null,null,null,null,null,null,null,null,0]
[null,null,null,null,"",null,null,null,null,"→",null,null,null,null,null,null,null,null,null,null,null,null,null,null,null,0]
[null,null,null,null,"",null,null,null,null,"→",null,null,null,null,null,null,null,null,null,null,null,null,null,null,null,0]
[null,null,null,null,"",null,null,null,null,"→",null,null,null,null,null,null,null,null,null,null,null,null,null,null,null,0]
[null,null,null,null,"",null,null,null,null,"→",null,null,null,null,null,null,null,null,null,null,null,null,null,null,null,0]
["合　計",null,null,null,null,null,null,null,null,null,null,null,null,null,null,null,null,null,null,null,null,null,null,null,null,"a",null,null,"b",null,null,null,null,"c",null,null,"d"]
[null,null,null,null,null,null,null,null,null,null,null,null,null,null,null,null,null,null,null,null,null,null,null,null,null,{"$f":"SUM(Z27:AB38)","v":0},null,null,{"$f":"ROUNDDOWN((SUMIFS(Q27:S38,N27:P38,\"自家用車\")),0)*37","v":0},null,null,null,null,{"$f":"SUM(AH27:AJ38)","v":0},null,null,{"$f":"SUM(AK27:AM38)","v":0}]
[]
["(備　考)",null,null,null,null,"※出発地が現住所と異なる場合は出発地（駅名/バス停名）及びその理由を記入してください"]
[]
[]
["※本事業で得た個人情報は、本事業内のみで使用します"]
["※本事業の専用ウェブページにある[個人情報について]に同意していただいたものとします"]

{"sheet":"【様式４】補助者⑧","index":12,"n_rows":46,"n_cols":41,"rows_kept":46,"cut":false,"hidden":false,"merged":[[0,0,0,2],[0,3,0,41],[1,0,1,41],[2,0,2,41],[3,0,3,41],[4,0,4,3],[4,4,4,5],[4,6,4,11],[4,12,4,13],[4,14,4,19],[7,0,7,3],[7,4,7,18],[7,19,7,22],[7,23,7,29],[7,30,7,41],[8,0,8,41],[4,20,4,21],[4,22,4,27],[4,29,4,33],[4,34,4,41],[5,0,5,41],[6,4,6,41],[10,0,10,3],[10,4,10,14],[10,15,10,18],[10,19,10,29],[10,30,10,33],[10,34,10,41],[9,5,9,28],[9,29,9,30],[9,31,9,32],[9,34,9,35],[9,37,9,38],[9,40,9,41],[12,0,12,3],[12,4,12,14],[12,15,12,18],[12,19,12,29],[12,30,12,33],[12,34,12,41],[11,0,11,3],[11,4,11,14],[11,15,11,18],[11,19,11,29],[11,30,11,33],[11,34,11,41],[13,0,13,3],[13,5,13,6],[13,8,13,10],[13,11,13,18],[13,19,13,41],[14,0,14,3],[14,4,14,14],[14,15,14,18],[14,19,14,29],[14,30,14,41],[17,0,17,1],[17,3,17,4],[17,6,17,20],[17,21,17,22],[17,24,17,25],[17,27,17,41],[15,0,15,20],[15,21,15,22],[15,24,15,25],[15,27,15,41],[16,0,16,1],[16,3,16,4],[16,6,16,20],[16,21,16,22],[16,24,16,25],[16,27,16,41],[19,0,19,41],[20,0,21,3],[22,0,23,3],[22,4,23,10],[22,11,23,12],[22,13,23,13],[18,0,18,1],[18,3,18,4],[18,6,18,20],[18,21,18,22],[18,24,18,25],[18,27,18,41],[20,18,23,41],[20,4,21,17],[24,22,25,24],[24,25,25,27],[24,28,25,32],[24,33,25,35],[24,36,25,38],[24,39,25,41],[24,0,25,3],[24,4,25,5],[24,6,24,12],[24,13,25,15],[24,16,25,18],[24,19,25,21],[25,6,25,8],[25,10,25,12],[26,39,26,41],[27,0,27,3],[27,4,27,5],[27,6,27,8],[27,10,27,12],[27,13,27,15],[27,16,27,18],[27,19,27,21],[27,22,27,24],[27,25,27,27],[26,19,26,21],[26,22,26,24],[26,25,26,27],[26,28,26,32],[26,33,26,35],[26,36,26,38],[26,0,26,3],[26,4,26,5],[26,6,26,8],[26,10,26,12],[26,13,26,15],[26,16,26,18],[27,28,27,32],[27,33,27,35],[27,36,27,38],[27,39,27,41],[28,0,28,3],[28,4,28,5],[28,6,28,8],[28,10,28,12],[28,13,28,15],[28,16,28,18],[28,39,28,41],[28,19,28,21],[28,22,28,24],[28,25,28,27],[28,28,28,32],[28,33,28,35],[28,36,28,38],[29,39,29,41],[30,0,30,3],[30,4,30,5],[30,6,30,8],[30,10,30,12],[30,13,30,15],[30,16,30,18],[30,39,30,41],[30,19,30,21],[30,22,30,24],[30,25,30,27],[30,28,30,32],[30,33,30,35],[30,36,30,38],[29,0,29,3],[29,4,29,5],[29,6,29,8],[29,10,29,12],[29,13,29,15],[29,16,29,18],[29,19,29,21],[29,22,29,24],[29,25,29,27],[31,10,31,12],[31,13,31,15],[31,16,31,18],[31,19,31,21],[31,22,31,24],[31,25,31,27],[29,28,29,32],[29,33,29,35],[29,36,29,38],[33,16,33,18],[33,19,33,21],[33,22,33,24],[33,25,33,27],[31,28,31,32],[31,33,31,35],[31,36,31,38],[31,39,31,41],[32,0,32,3],[32,4,32,5],[32,6,32,8],[32,10,32,12],[32,13,32,15],[32,16,32,18],[32,39,32,41],[32,19,32,21],[32,22,32,24],[32,25,32,27],[32,28,32,32],[32,33,32,35],[32,36,32,38],[31,0,31,3],[31,4,31,5],[31,6,31,8],[35,22,35,24],[35,25,35,27],[33,28,33,32],[33,33,33,35],[33,36,33,38],[33,39,33,41],[34,0,34,3],[34,4,34,5],[34,6,34,8],[34,10,34,12],[34,13,34,15],[34,16,34,18],[34,39,34,41],[34,19,34,21],[34,22,34,24],[34,25,34,27],[34,28,34,32],[34,33,34,35],[34,36,34,38],[33,0,33,3],[33,4,33,5],[33,6,33,8],[33,10,33,12],[33,13,33,15],[35,28,35,32],[35,33,35,35],[35,36,35,38],[35,39,35,41],[36,0,36,3],[36,4,36,5],[36,6,36,8],[36,10,36,12],[36,13,36,15],[36,16,36,18],[36,39,36,41],[36,19,36,21],[36,22,36,24],[36,25,36,27],[36,28,36,32],[36,33,36,35],[36,36,36,38],[35,0,35,3],[35,4,35,5],[35,6,35,8],[35,10,35,12],[35,13,35,15],[35,16,35,18],[35,19,35,21],[37,28,37,32],[37,33,37,35],[37,36,37,38],[37,39,37,41],[38,0,39,24],[38,25,38,27],[38,28,38,32],[38,33,38,35],[38,36,38,38],[38,39,39,41],[37,0,37,3],[37,4,37,5],[37,6,37,8],[37,10,37,12],[37,13,37,15],[37,16,37,18],[37,19,37,21],[37,22,37,24],[37,25,37,27],[42,0,43,41],[44,15,44,41],[45,22,45,41],[39,25,39,27],[39,28,39,32],[39,33,39,35],[39,36,39,38],[40,0,40,41],[41,0,41,3]]}
["様式４"]
["令和4年度文化芸術による子供育成推進事業（芸術家の派遣事業）"]
["被派遣者 略歴書(兼)旅費計算書"]
[]
["実施日",null,null,null,"第1回",null,{"$f":"IF(【様式２・３】実施希望調書!E25=\"\",\"\",【様式２・３】実施希望調書!E25)","v":"2022-06-10"},null,null,null,null,null,"第2回",null,{"$f":"IF(【様式２・３】実施希望調書!E43=\"\",\"\",【様式２・３】実施希望調書!E43)","v":"2022-06-17"},null,null,null,null,null,"第3回",null,{"$f":"IF(【様式２・３】実施希望調書!E61=\"\",\"\",【様式２・３】実施希望調書!E61)","v":"2022-06-23"},null,null,null,null,null,null,"都道府県・\n政令指定都市名",null,null,null,null,{"$f":"IF(【様式２・３】実施希望調書!E4=\"\",\"\",【様式２・３】実施希望調書!E4)","v":"北海道"}]
[]
["①派遣先"]
["学校名",null,null,null,{"$f":"IF(【様式２・３】実施希望調書!E7=\"\",\"\",【様式２・３】実施希望調書!E7)","v":"○○市立文化小学校"},null,null,null,null,null,null,null,null,null,null,null,null,null,null,"最寄駅/バス停"]
[]
["②被派遣者",null,null,null,null,null,null,null,null,null,null,null,null,null,null,null,null,null,null,null,null,null,null,null,null,null,null,null,null,"令和",null,null,null,"年",null,null,"月",null,null,"日","現在"]
["ふりがな",null,null,null,null,null,null,null,null,null,null,null,null,null,null,"ふりがな",null,null,null,null,null,null,null,null,null,null,null,null,null,null,"生年月日"]
["本名",null,null,null,{"$f":"IF(【様式２・３】実施希望調書!G101=\"\",\"　\",【様式２・３】実施希望調書!G101)","v":"　"},null,null,null,null,null,null,null,null,null,null,"芸名",null,null,null,null,null,null,null,null,null,null,null,null,null,null,"性別"]
["専門分野",null,null,null,null,null,null,null,null,null,null,null,null,null,null,"所属団体",null,null,null,null,null,null,null,null,null,null,null,null,null,null,"職業"]
["現住所",null,null,null,"〒",null,null,"-"]
["最寄交通機関",null,null,null,null,null,null,null,null,null,null,null,null,null,null,"最寄駅/バス停"]
["■専門分野に係る主な賞歴、活動実績など",null,null,null,null,null,null,null,null,null,null,null,null,null,null,null,null,null,null,null,null,null,null,"年",null,null,"月"]
[null,null,"年",null,null,"月",null,null,null,null,null,null,null,null,null,null,null,null,null,null,null,null,null,"年",null,null,"月"]
[null,null,"年",null,null,"月",null,null,null,null,null,null,null,null,null,null,null,null,null,null,null,null,null,"年",null,null,"月"]
[null,null,"年",null,null,"月",null,null,null,null,null,null,null,null,null,null,null,null,null,null,null,null,null,"年",null,null,"月"]
[]
["③旅費",null,null,null,"↓（申請時）様式3に転記してください\n　（報告時）様式10に転記してください",null,null,null,null,null,null,null,null,null,null,null,null,null,"※本事業の旅費基準に従って計上してください\n※乗り換え毎に行を分けて記入してください\n※交通機関名欄は、プルダウンより選択してください\n※バス運賃の根拠書類を添付してください（運賃表、検索画面のコピー等）\n※距離を必ず記入してください"]
[]
["旅費合計\n（a+b+c+d)",null,null,null,{"$f":"Z40+AC40+AH40+AK40","v":0},null,null,null,null,null,null,"円"]
[]
["日付",null,null,null,"曜日",null,"移動区間",null,null,null,null,null,null,"※交通\n機関名",null,null,"※距離\n(㎞)",null,null,"運賃\n乗車券",null,null,"特急\n急行料金",null,null,"交通費\n小計",null,null,"車 賃",null,null,null,null,"日当",null,null,"宿泊費",null,null,"宿泊地"]
[null,null,null,null,null,null,"発地",null,null,"→","着地"]
[null,null,null,null,{"$f":"IF(A27=\"\",\"\",A27)","v":""},null,null,null,null,"→",null,null,null,null,null,null,null,null,null,null,null,null,null,null,null,{"$f":"SUM(T27:Y27)","v":0}]
[null,null,null,null,"",null,null,null,null,"→",null,null,null,null,null,null,null,null,null,null,null,null,null,null,null,0]
[null,null,null,null,"",null,null,null,null,"→",null,null,null,null,null,null,null,null,null,null,null,null,null,null,null,0]
[null,null,null,null,"",null,null,null,null,"→",null,null,null,null,null,null,null,null,null,null,null,null,null,null,null,0]
[null,null,null,null,"",null,null,null,null,"→",null,null,null,null,null,null,null,null,null,null,null,null,null,null,null,0]
[null,null,null,null,"",null,null,null,null,"→",null,null,null,null,null,null,null,null,null,null,null,null,null,null,null,0]
[null,null,null,null,"",null,null,null,null,"→",null,null,null,null,null,null,null,null,null,null,null,null,null,null,null,0]
[null,null,null,null,"",null,null,null,null,"→",null,null,null,null,null,null,null,null,null,null,null,null,null,null,null,0]
[null,null,null,null,"",null,null,null,null,"→",null,null,null,null,null,null,null,null,null,null,null,null,null,null,null,0]
[null,null,null,null,"",null,null,null,null,"→",null,null,null,null,null,null,null,null,null,null,null,null,null,null,null,0]
[null,null,null,null,"",null,null,null,null,"→",null,null,null,null,null,null,null,null,null,null,null,null,null,null,null,0]
[null,null,null,null,"",null,null,null,null,"→",null,null,null,null,null,null,null,null,null,null,null,null,null,null,null,0]
["合　計",null,null,null,null,null,null,null,null,null,null,null,null,null,null,null,null,null,null,null,null,null,null,null,null,"a",null,null,"b",null,null,null,null,"c",null,null,"d"]
[null,null,null,null,null,null,null,null,null,null,null,null,null,null,null,null,null,null,null,null,null,null,null,null,null,{"$f":"SUM(Z27:AB38)","v":0},null,null,{"$f":"ROUNDDOWN((SUMIFS(Q27:S38,N27:P38,\"自家用車\")),0)*37","v":0},null,null,null,null,{"$f":"SUM(AH27:AJ38)","v":0},null,null,{"$f":"SUM(AK27:AM38)","v":0}]
[]
["(備　考)",null,null,null,null,"※出発地が現住所と異なる場合は出発地（駅名/バス停名）及びその理由を記入してください"]
[]
[]
["※本事業で得た個人情報は、本事業内のみで使用します"]
["※本事業の専用ウェブページにある[個人情報について]に同意していただいたものとします"]

{"sheet":"CopySource【様式４】補助者","index":13,"n_rows":46,"n_cols":41,"rows_kept":46,"cut":false,"hidden":true,"merged":[[42,0,43,41],[44,15,44,41],[45,22,45,41],[39,25,39,27],[39,28,39,32],[39,33,39,35],[39,36,39,38],[40,0,40,41],[41,0,41,3],[37,28,37,32],[37,33,37,35],[37,36,37,38],[37,39,37,41],[38,0,39,24],[38,25,38,27],[38,28,38,32],[38,33,38,35],[38,36,38,38],[38,39,39,41],[37,0,37,3],[37,4,37,5],[37,6,37,8],[37,10,37,12],[37,13,37,15],[37,16,37,18],[37,19,37,21],[37,22,37,24],[37,25,37,27],[35,28,35,32],[35,33,35,35],[35,36,35,38],[35,39,35,41],[36,0,36,3],[36,4,36,5],[36,6,36,8],[36,10,36,12],[36,13,36,15],[36,16,36,18],[36,39,36,41],[36,19,36,21],[36,22,36,24],[36,25,36,27],[36,28,36,32],[36,33,36,35],[36,36,36,38],[35,0,35,3],[35,4,35,5],[35,6,35,8],[35,10,35,12],[35,13,35,15],[35,16,35,18],[35,19,35,21],[35,22,35,24],[35,25,35,27],[33,28,33,32],[33,33,33,35],[33,36,33,38],[33,39,33,41],[34,0,34,3],[34,4,34,5],[34,6,34,8],[34,10,34,12],[34,13,34,15],[34,16,34,18],[34,39,34,41],[34,19,34,21],[34,22,34,24],[34,25,34,27],[34,28,34,32],[34,33,34,35],[34,36,34,38],[33,0,33,3],[33,4,33,5],[33,6,33,8],[33,10,33,12],[33,13,33,15],[33,16,33,18],[33,19,33,21],[33,22,33,24],[33,25,33,27],[31,28,31,32],[31,33,31,35],[31,36,31,38],[31,39,31,41],[32,0,32,3],[32,4,32,5],[32,6,32,8],[32,10,32,12],[32,13,32,15],[32,16,32,18],[32,39,32,41],[32,19,32,21],[32,22,32,24],[32,25,32,27],[32,28,32,32],[32,33,32,35],[32,36,32,38],[31,0,31,3],[31,4,31,5],[31,6,31,8],[31,10,31,12],[31,13,31,15],[31,16,31,18],[31,19,31,21],[31,22,31,24],[31,25,31,27],[29,28,29,32],[29,33,29,35],[29,36,29,38],[29,39,29,41],[30,0,30,3],[30,4,30,5],[30,6,30,8],[30,10,30,12],[30,13,30,15],[30,16,30,18],[30,39,30,41],[30,19,30,21],[30,22,30,24],[30,25,30,27],[30,28,30,32],[30,33,30,35],[30,36,30,38],[29,0,29,3],[29,4,29,5],[29,6,29,8],[29,10,29,12],[29,13,29,15],[29,16,29,18],[29,19,29,21],[29,22,29,24],[29,25,29,27],[27,36,27,38],[27,39,27,41],[28,0,28,3],[28,4,28,5],[28,6,28,8],[28,10,28,12],[28,13,28,15],[28,16,28,18],[28,39,28,41],[28,19,28,21],[28,22,28,24],[28,25,28,27],[28,28,28,32],[28,33,28,35],[28,36,28,38],[26,39,26,41],[27,0,27,3],[27,4,27,5],[27,6,27,8],[27,10,27,12],[27,13,27,15],[27,16,27,18],[27,19,27,21],[27,22,27,24],[27,25,27,27],[26,19,26,21],[26,22,26,24],[26,25,26,27],[26,28,26,32],[26,33,26,35],[26,36,26,38],[26,0,26,3],[26,4,26,5],[26,6,26,8],[26,10,26,12],[26,13,26,15],[26,16,26,18],[27,28,27,32],[27,33,27,35],[24,22,25,24],[24,25,25,27],[24,28,25,32],[24,33,25,35],[24,36,25,38],[24,39,25,41],[24,0,25,3],[24,4,25,5],[24,6,24,12],[24,13,25,15],[24,16,25,18],[24,19,25,21],[25,6,25,8],[25,10,25,12],[19,0,19,41],[20,0,21,3],[20,4,21,17],[20,18,23,41],[22,0,23,3],[22,4,23,10],[22,11,23,12],[22,13,23,13],[18,0,18,1],[18,3,18,4],[18,6,18,20],[18,21,18,22],[18,24,18,25],[18,27,18,41],[17,0,17,1],[17,3,17,4],[17,6,17,20],[17,21,17,22],[17,24,17,25],[17,27,17,41],[15,0,15,20],[15,21,15,22],[15,24,15,25],[15,27,15,41],[16,0,16,1],[16,3,16,4],[16,6,16,20],[16,21,16,22],[16,24,16,25],[16,27,16,41],[13,0,13,3],[13,5,13,6],[13,8,13,10],[13,11,13,18],[13,19,13,41],[14,0,14,3],[14,4,14,14],[14,15,14,18],[14,19,14,29],[14,30,14,41],[12,0,12,3],[12,4,12,14],[12,15,12,18],[12,19,12,29],[12,30,12,33],[12,34,12,41],[11,0,11,3],[11,4,11,14],[11,15,11,18],[11,19,11,29],[11,30,11,33],[11,34,11,41],[10,0,10,3],[10,4,10,14],[10,15,10,18],[10,19,10,29],[10,30,10,33],[10,34,10,41],[9,5,9,28],[9,29,9,30],[9,31,9,32],[9,34,9,35],[9,37,9,38],[9,40,9,41],[7,0,7,3],[7,4,7,18],[7,19,7,22],[7,23,7,29],[7,30,7,41],[8,0,8,41],[4,20,4,21],[4,22,4,27],[4,29,4,33],[4,34,4,41],[5,0,5,41],[6,4,6,41],[0,0,0,2],[0,3,0,41],[1,0,1,41],[2,0,2,41],[3,0,3,41],[4,0,4,3],[4,4,4,5],[4,6,4,11],[4,12,4,13],[4,14,4,19]]}
["様式４"]
["令和4年度文化芸術による子供育成総合事業（芸術家の派遣事業）"]
["被派遣者 略歴書(兼)旅費計算書"]
[]
["実施日",null,null,null,"第1回",null,{"$f":"IF(【様式２・３】実施希望調書!E25=\"\",\"\",【様式２・３】実施希望調書!E25)","v":"2022-06-10"},null,null,null,null,null,"第2回",null,{"$f":"IF(【様式２・３】実施希望調書!E43=\"\",\"\",【様式２・３】実施希望調書!E43)","v":"2022-06-17"},null,null,null,null,null,"第3回",null,{"$f":"IF(【様式２・３】実施希望調書!E61=\"\",\"\",【様式２・３】実施希望調書!E61)","v":"2022-06-23"},null,null,null,null,null,null,"都道府県・\n政令指定都市名",null,null,null,null,{"$f":"IF(【様式２・３】実施希望調書!E4=\"\",\"\",【様式２・３】実施希望調書!E4)","v":"北海道"}]
[]
["①派遣先"]
["学校名",null,null,null,{"$f":"IF(【様式２・３】実施希望調書!E7=\"\",\"\",【様式２・３】実施希望調書!E7)","v":"○○市立文化小学校"},null,null,null,null,null,null,null,null,null,null,null,null,null,null,"最寄駅/バス停"]
[]
["②被派遣者",null,null,null,null,null,null,null,null,null,null,null,null,null,null,null,null,null,null,null,null,null,null,null,null,null,null,null,null,"令和",null,null,null,"年",null,null,"月",null,null,"日","現在"]
["ふりがな",null,null,null,null,null,null,null,null,null,null,null,null,null,null,"ふりがな",null,null,null,null,null,null,null,null,null,null,null,null,null,null,"生年月日"]
["本名",null,null,null,null,null,null,null,null,null,null,null,null,null,null,"芸名",null,null,null,null,null,null,null,null,null,null,null,null,null,null,"性別"]
["専門分野",null,null,null,null,null,null,null,null,null,null,null,null,null,null,"所属団体",null,null,null,null,null,null,null,null,null,null,null,null,null,null,"職業"]
["現住所",null,null,null,"〒",null,null,"-"]
["最寄交通機関",null,null,null,null,null,null,null,null,null,null,null,null,null,null,"最寄駅/バス停"]
["■専門分野に係る主な賞歴、活動実績など",null,null,null,null,null,null,null,null,null,null,null,null,null,null,null,null,null,null,null,null,null,null,"年",null,null,"月"]
[null,null,"年",null,null,"月",null,null,null,null,null,null,null,null,null,null,null,null,null,null,null,null,null,"年",null,null,"月"]
[null,null,"年",null,null,"月",null,null,null,null,null,null,null,null,null,null,null,null,null,null,null,null,null,"年",null,null,"月"]
[null,null,"年",null,null,"月",null,null,null,null,null,null,null,null,null,null,null,null,null,null,null,null,null,"年",null,null,"月"]
[]
["③旅費",null,null,null,"↓（申請時）様式3に転記してください\n　（報告時）様式10に転記してください",null,null,null,null,null,null,null,null,null,null,null,null,null,"※本事業の旅費基準に従って計上してください\n※乗り換え毎に行を分けて記入してください\n※交通機関名欄は、プルダウンより選択してください\n※バス運賃の根拠書類を添付してください（運賃表、検索画面のコピー等）\n※距離を必ず記入してください"]
[]
["旅費合計\n（a+b+c+d)",null,null,null,{"$f":"Z40+AC40+AH40+AK40","v":0},null,null,null,null,null,null,"円"]
[]
["日付",null,null,null,"曜日",null,"移動区間",null,null,null,null,null,null,"※交通\n機関名",null,null,"※距離\n(㎞)",null,null,"運賃\n乗車券",null,null,"特急\n急行料金",null,null,"交通費\n小計",null,null,"車 賃",null,null,null,null,"日当",null,null,"宿泊費",null,null,"宿泊地"]
[null,null,null,null,null,null,"発地",null,null,"→","着地"]
[null,null,null,null,{"$f":"IF(A27=\"\",\"\",A27)","v":""},null,null,null,null,"→",null,null,null,null,null,null,null,null,null,null,null,null,null,null,null,{"$f":"SUM(T27:Y27)","v":0}]
[null,null,null,null,"",null,null,null,null,"→",null,null,null,null,null,null,null,null,null,null,null,null,null,null,null,0]
[null,null,null,null,"",null,null,null,null,"→",null,null,null,null,null,null,null,null,null,null,null,null,null,null,null,0]
[null,null,null,null,"",null,null,null,null,"→",null,null,null,null,null,null,null,null,null,null,null,null,null,null,null,0]
[null,null,null,null,"",null,null,null,null,"→",null,null,null,null,null,null,null,null,null,null,null,null,null,null,null,0]
[null,null,null,null,"",null,null,null,null,"→",null,null,null,null,null,null,null,null,null,null,null,null,null,null,null,0]
[null,null,null,null,"",null,null,null,null,"→",null,null,null,null,null,null,null,null,null,null,null,null,null,null,null,0]
[null,null,null,null,"",null,null,null,null,"→",null,null,null,null,null,null,null,null,null,null,null,null,null,null,null,0]
[null,null,null,null,"",null,null,null,null,"→",null,null,null,null,null,null,null,null,null,null,null,null,null,null,null,0]
[null,null,null,null,"",null,null,null,null,"→",null,null,null,null,null,null,null,null,null,null,null,null,null,null,null,0]
[null,null,null,null,"",null,null,null,null,"→",null,null,null,null,null,null,null,null,null,null,null,null,null,null,null,0]
[null,null,null,null,"",null,null,null,null,"→",null,null,null,null,null,null,null,null,null,null,null,null,null,null,null,0]
["合　計",null,null,null,null,null,null,null,null,null,null,null,null,null,null,null,null,null,null,null,null,null,null,null,null,"a",null,null,"b",null,null,null,null,"c",null,null,"d"]
[null,null,null,null,null,null,null,null,null,null,null,null,null,null,null,null,null,null,null,null,null,null,null,null,null,{"$f":"SUM(Z27:AB38)","v":0},null,null,{"$f":"ROUNDDOWN((SUMIFS(Q27:S38,N27:P38,\"自家用車\")),0)*37","v":0},null,null,null,null,{"$f":"SUM(AH27:AJ38)","v":0},null,null,{"$f":"SUM(AK27:AM38)","v":0}]
[]
["(備　考)",null,null,null,null,"※出発地が現住所と異なる場合は出発地（駅名/バス停名）及びその理由を記入してください"]
[]
[]
["※本事業で得た個人情報は、本事業内のみで使用します"]
["※本事業の専用ウェブページにある[個人情報について]に同意していただいたものとします"]

{"sheet":"【分野】","index":14,"n_rows":12,"n_cols":34,"rows_kept":12,"cut":false,"hidden":false,"merged":[[3,28,3,31],[3,32,3,35],[0,0,0,35],[1,0,1,3],[1,4,1,35],[2,1,2,3],[2,5,2,7],[2,9,2,11],[2,13,2,15],[2,17,2,19],[2,21,2,23],[2,25,2,27],[2,28,2,31],[2,32,2,35],[4,20,4,23],[4,24,4,27],[4,28,4,31],[4,32,4,35],[3,1,3,3],[3,5,3,7],[3,9,3,11],[3,13,3,15],[3,17,3,19],[4,1,4,3],[4,5,4,7],[4,9,4,11],[4,13,4,15],[4,17,4,19],[3,20,3,23],[3,24,3,27],[5,24,5,27],[5,28,5,31],[5,32,5,35],[6,1,6,3],[6,5,6,7],[6,9,6,11],[6,13,6,15],[6,17,6,19],[6,21,6,23],[6,25,6,27],[5,1,5,3],[5,5,5,7],[5,9,5,11],[5,13,5,15],[5,17,5,19],[5,21,5,23],[6,29,6,31],[6,32,6,35],[7,1,7,3],[7,5,7,7],[7,9,7,11],[7,13,7,15],[7,17,7,19],[7,21,7,23],[7,25,7,27],[7,29,7,31],[9,13,9,15],[9,17,9,19],[9,21,9,23],[7,33,7,35],[8,1,8,3],[8,5,8,7],[8,9,8,11],[8,13,8,15],[8,16,8,19],[8,20,8,23],[8,24,8,27],[8,28,8,31],[8,32,8,35],[10,28,10,31],[10,32,10,35],[11,0,11,35],[9,25,9,27],[9,29,9,31],[9,32,9,35],[10,1,10,3],[10,5,10,7],[10,9,10,11],[10,13,10,15],[10,17,10,19],[10,21,10,23],[10,24,10,27],[9,1,9,3],[9,5,9,7],[9,9,9,11]]}
["【分野】"]
["大項目",null,null,null,"中項目"]
[1,"音楽",null,null,"A","ピアノ",null,null,"B","声楽",null,null,"C","弦楽器",null,null,"D","パーカッション",null,null,"E","管楽器",null,null,"F","その他"]
[2,"演劇",null,null,"A","現代劇",null,null,"B","ミュージカル",null,null,"C","人形劇",null,null,"D","その他"]
[3,"舞踊",null,null,"A","バレエ",null,null,"B","現代舞踊",null,null,"C","身体表現",null,null,"D","その他"]
[4,"大衆芸能",null,null,"A","落語",null,null,"B","講談",null,null,"C","漫才",null,null,"D","浪曲",null,null,"E","その他"]
[5,"美術",null,null,"A","洋画",null,null,"B","日本画",null,null,"C","版画",null,null,"D","彫刻",null,null,"E","書",null,null,"F","写真",null,null,"G","その他"]
[6,"伝統芸能",null,null,"A","歌舞伎",null,null,"B","　能楽",null,null,"C","人形浄瑠璃",null,null,"D","日本舞踊",null,null,"E","和太鼓",null,null,"F","箏",null,null,"G","三味線",null,null,"H","その他"]
[7,"文学",null,null,"A","俳句",null,null,"B","朗読",null,null,"C","その他"]
[8,"生活文化",null,null,"A","囲碁",null,null,"B","将棋",null,null,"C","華道",null,null,"D","茶道",null,null,"E","和装",null,null,"F","食文化",null,null,"G","その他"]
[9,"メディア\n芸術",null,null,"A","メディアアート",null,null,"B","映画",null,null,"C","アニメーション",null,null,"D","マンガ",null,null,"E","その他"]
["※様式１、様式２及び様式６の実施分野欄に、大項目名・中項目の英字・項目名を記入してください"]

{"sheet":"（様式2・3）集約用","index":15,"n_rows":3,"n_cols":215,"rows_kept":3,"cut":false,"hidden":true,"merged":[]}
["都道府県No.","都道府県名","都道府県担当部局","都道府県担当者氏名","都道府県TEL","都道府県FAX","都道府県メール","応募No.","推薦\n順位","実施希望校","実施希望校ふりがな","全校児童生徒","所在地郵便番号前","実施校所在地郵便番号後","実施校所在地都道府県","実施校所在地住所","実施校学校長名","実施校担当者名","実施校TEL","実施校FAX","実施校メール","実施会場","合同開催","実施分野大項目","実施分野中項目","実施\n回数","講師氏名","講師氏名ふりがな","所属団体","学校との関係","学校との関係その他","協力者名簿","連続実施年数同一講師","連続実施年数同一分野","連続実施確認１","連続実施理由項目","連続実施理由詳細","実施日第1回","実施時間1回目","実施合計1回目","連続する実施1回目","連続都道府県1回目","連続学校名1回目","教科の位置付け1回目","教科の位置付け詳細1回目","著作権1回目","著作権許諾取得有無1回目","参加児童生徒数1回目","参加児童生徒単位1回目","参加児童生徒単位詳細1回目","補助者①氏名1回目","補助者①演奏時間1回目","補助者①実技時間1回目","補助者①単労時間1回目","補助者①謝金合計1回目","補助者②氏名1回目","補助者②演奏時間1回目","補助者②実技時間1回目","補助者②単労時間1回目","補助者②謝金合計1回目","補助者③氏名1回目","補助者③演奏時間1回目","補助者③実技時間1回目","補助者③単労時間1回目","補助者③謝金合計1回目","補助者④氏名1回目","補助者④演奏時間1回目","補助者④実技時間1回目","補助者④単労時間1回目","補助者④謝金合計1回目","補助者⑤氏名1回目","補助者⑤演奏時間1回目","補助者⑤実技時間1回目","補助者⑤単労時間1回目","補助者⑤謝金合計1回目","補助者⑥氏名1回目","補助者⑥演奏時間1回目","補助者⑥実技時間1回目","補助者⑥単労時間1回目","補助者⑥謝金合計1回目","補助者⑦氏名1回目","補助者⑦演奏時間1回目","補助者⑦実技時間1回目","補助者⑦単労時間1回目","補助者⑦謝金合計1回目","補助者⑧氏名1回目","補助者⑧演奏時間1回目","補助者⑧実技時間1回目","補助者⑧単労時間1回目","補助者⑧謝金合計1回目","1回目補助者人数","1回目謝金合計","事業内容1回目","実施日第2回","実施時間2回目","実施合計2回目","連続する実施2回目","連続都道府県2回目","連続学校名2回目","教科の位置付け2回目","教科の位置付け詳細2回目","著作権2回目","著作権許諾取得有無2回目","参加児童生徒数2回目","参加児童生徒単位2回目","参加児童生徒単位詳細2回目","補助者①氏名2回目","補助者①演奏時間2回目","補助者①実技時間2回目","補助者①単労時間2回目","補助者①謝金合計2回目","補助者②氏名2回目","補助者②演奏時間2回目","補助者②実技時間2回目","補助者②単労時間2回目","補助者②謝金合計2回目","補助者③氏名2回目","補助者③演奏時間2回目","補助者③実技時間2回目","補助者③単労時間2回目","補助者③謝金合計2回目","補助者④氏名2回目","補助者④演奏時間2回目","補助者④実技時間2回目","補助者④単労時間2回目","補助者④謝金合計2回目","補助者⑤氏名2回目","補助者⑤演奏時間2回目","補助者⑤実技時間2回目","補助者⑤単労時間2回目","補助者⑤謝金合計2回目","補助者⑥氏名2回目","補助者⑥演奏時間2回目","補助者⑥実技時間2回目","補助者⑥単労時間2回目","補助者⑥謝金合計2回目","補助者⑦氏名2回目","補助者⑦演奏時間2回目","補助者⑦実技時間2回目","補助者⑦単労時間2回目","補助者⑦謝金合計2回目","補助者⑧氏名2回目","補助者⑧演奏時間2回目","補助者⑧実技時間2回目","補助者⑧単労時間2回目","補助者⑧謝金合計2回目","2回目補助者人数","2回目謝金合計","事業内容2回目","実施日第3回","実施時間3回目","実施合計3回目","連続する実施3回目","連続都道府県3回目","連続学校名3回目","教科の位置付け3回目","教科の位置付け詳細3回目","著作権3回目","著作権許諾取得有無3回目","参加児童生徒数3回目","参加児童生徒単位3回目","参加児童生徒単位詳細3回目","補助者①氏名3回目","補助者①演奏時間3回目","補助者①実技時間3回目","補助者①単労時間3回目","補助者①謝金合計3回目","補助者②氏名3回目","補助者②演奏時間3回目","補助者②実技時間3回目","補助者②単労時間3回目","補助者②謝金合計3回目","補助者③氏名3回目","補助者③演奏時間3回目","補助者③実技時間3回目","補助者③単労時間3回目","補助者③謝金合計3回目","補助者④氏名3回目","補助者④演奏時間3回目","補助者④実技時間3回目","補助者④単労時間3回目","補助者④謝金合計3回目","補助者⑤氏名3回目","補助者⑤演奏時間3回目","補助者⑤実技時間3回目","補助者⑤単労時間3回目","補助者⑤謝金合計3回目","補助者⑥氏名3回目","補助者⑥演奏時間3回目","補助者⑥実技時間3回目","補助者⑥単労時間3回目","補助者⑥謝金合計3回目","補助者⑦氏名3回目","補助者⑦演奏時間3回目","補助者⑦実技時間3回目","補助者⑦単労時間3回目","補助者⑦謝金合計3回目","補助者⑧氏名3回目","補助者⑧演奏時間3回目","補助者⑧実技時間3回目","補助者⑧単労時間3回目","補助者⑧謝金合計3回目","3回目補助者人数","3回目謝金合計","事業内容3回目","謝金","旅費","講演等\n諸雑費","合計","過疎","山村","離島","半島","奄美／\n小笠原","備考"]
[null,"【様式１】!P4","【様式１】!P5","【様式１】!P6","【様式１】!X4","【様式１】!X5","【様式１】!X6","【様式２・３】実施希望調書!U1","【様式１】実施希望調書!B10","【様式２・３】実施希望調書!E7","【様式２・３】実施希望調書!E6","【様式２・３】実施希望調書!W6","【様式２・３】実施希望調書!F8","【様式２・３】実施希望調書!J8","【様式２・３】実施希望調書!P8","【様式２・３】実施希望調書!E9","【様式２・３】実施希望調書!W8","【様式２・３】実施希望調書!W9","【様式２・３】実施希望調書!W10","【様式２・３】実施希望調書!W11","【様式２・３】実施希望調書!W11","【様式２・３】実施希望調書!E10","【様式２・３】実施希望調書!H11","【様式２・３】実施希望調書!E13","【様式２・３】実施希望調書!I13","【様式２・３】実施希望調書!F14","【様式２・３】実施希望調書!E16","【様式２・３】実施希望調書!E15","【様式２・３】実施希望調書!W15","【様式２・３】実施希望調書!E17","【様式２・３】実施希望調書!S17","【様式２・３】実施希望調書!E18","【様式２・３】実施希望調書!U18","【様式２・３】実施希望調書!AA18","【様式２・３】実施希望調書!AB20","【様式２・３】実施希望調書!E22","【様式２・３】実施希望調書!E24","【様式２・３】実施希望調書!E25","【様式２・３】実施希望調書!S25","【様式２・３】実施希望調書!AA25","【様式２・３】実施希望調書!E26","【様式２・３】実施希望調書!O26","【様式２・３】実施希望調書!V26","【様式２・３】実施希望調書!E27","【様式２・３】実施希望調書!S27","【様式２・３】実施希望調書!E28","【様式２・３】実施希望調書!V28","【様式２・３】実施希望調書!G29","【様式２・３】実施希望調書!P29","【様式２・３】実施希望調書!S30","【様式２・３】実施希望調書!F32","【様式２・３】実施希望調書!N32","【様式２・３】実施希望調書!S32","【様式２・３】実施希望調書!X32","【様式２・３】実施希望調書!AA32","【様式２・３】実施希望調書!F33","【様式２・３】実施希望調書!N33","【様式２・３】実施希望調書!S33","【様式２・３】実施希望調書!X33","【様式２・３】実施希望調書!AA33","【様式２・３】実施希望調書!F34","【様式２・３】実施希望調書!N34","【様式２・３】実施希望調書!S34","【様式２・３】実施希望調書!X34","【様式２・３】実施希望調書!AA34","【様式２・３】実施希望調書!F35","【様式２・３】実施希望調書!N35","【様式２・３】実施希望調書!S35","【様式２・３】実施希望調書!X35","【様式２・３】実施希望調書!AA35","【様式２・３】実施希望調書!F36","【様式２・３】実施希望調書!N36","【様式２・３】実施希望調書!S36","【様式２・３】実施希望調書!X36","【様式２・３】実施希望調書!AA36","【様式２・３】実施希望調書!F37","【様式２・３】実施希望調書!N37","【様式２・３】実施希望調書!S37","【様式２・３】実施希望調書!X37","【様式２・３】実施希望調書!AA37","【様式２・３】実施希望調書!F38","【様式２・３】実施希望調書!N38","【様式２・３】実施希望調書!S38","【様式２・３】実施希望調書!X38","【様式２・３】実施希望調書!AA38","【様式２・３】実施希望調書!F39","【様式２・３】実施希望調書!N39","【様式２・３】実施希望調書!S39","【様式２・３】実施希望調書!X39","【様式２・３】実施希望調書!AA39","【様式２・３】実施希望調書!F40","【様式２・３】実施希望調書!AA40","【様式２・３】実施希望調書!B42","【様式２・３】実施希望調書!E43","【様式２・３】実施希望調書!S43","【様式２・３】実施希望調書!AA43","【様式２・３】実施希望調書!E44","【様式２・３】実施希望調書!O44","【様式２・３】実施希望調書!V44","【様式２・３】実施希望調書!E45","【様式２・３】実施希望調書!S45","【様式２・３】実施希望調書!E46","【様式２・３】実施希望調書!V46","【様式２・３】実施希望調書!G47","【様式２・３】実施希望調書!P47","【様式２・３】実施希望調書!S48","【様式２・３】実施希望調書!F50","【様式２・３】実施希望調書!N50","【様式２・３】実施希望調書!S50","【様式２・３】実施希望調書!X50","【様式２・３】実施希望調書!AA50","【様式２・３】実施希望調書!F51","【様式２・３】実施希望調書!N51","【様式２・３】実施希望調書!S51","【様式２・３】実施希望調書!X51","【様式２・３】実施希望調書!AA51","【様式２・３】実施希望調書!F52","【様式２・３】実施希望調書!N52","【様式２・３】実施希望調書!S52","【様式２・３】実施希望調書!X52","【様式２・３】実施希望調書!AA52","【様式２・３】実施希望調書!F53","【様式２・３】実施希望調書!N53","【様式２・３】実施希望調書!S53","【様式２・３】実施希望調書!X53","【様式２・３】実施希望調書!AA53","【様式２・３】実施希望調書!F54","【様式２・３】実施希望調書!N54","【様式２・３】実施希望調書!S54","【様式２・３】実施希望調書!X54","【様式２・３】実施希望調書!AA54","【様式２・３】実施希望調書!F55","【様式２・３】実施希望調書!N55","【様式２・３】実施希望調書!S55","【様式２・３】実施希望調書!X55","【様式２・３】実施希望調書!AA55","【様式２・３】実施希望調書!F56","【様式２・３】実施希望調書!N56","【様式２・３】実施希望調書!S56","【様式２・３】実施希望調書!X56","【様式２・３】実施希望調書!AA56","【様式２・３】実施希望調書!F57","【様式２・３】実施希望調書!N57","【様式２・３】実施希望調書!S57","【様式２・３】実施希望調書!X57","【様式２・３】実施希望調書!AA57","【様式２・３】実施希望調書!F58","【様式２・３】実施希望調書!AA58","【様式２・３】実施希望調書!B60","【様式２・３】実施希望調書!E61","【様式２・３】実施希望調書!S61","【様式２・３】実施希望調書!AA61","【様式２・３】実施希望調書!E62","【様式２・３】実施希望調書!O62","【様式２・３】実施希望調書!V62","【様式２・３】実施希望調書!E63","【様式２・３】実施希望調書!S63","【様式２・３】実施希望調書!E64","【様式２・３】実施希望調書!V64","【様式２・３】実施希望調書!G65","【様式２・３】実施希望調書!P65","【様式２・３】実施希望調書!S66","【様式２・３】実施希望調書!F68","【様式２・３】実施希望調書!N68","【様式２・３】実施希望調書!S68","【様式２・３】実施希望調書!X68","【様式２・３】実施希望調書!AA68","【様式２・３】実施希望調書!F69","【様式２・３】実施希望調書!N69","【様式２・３】実施希望調書!S69","【様式２・３】実施希望調書!X69","【様式２・３】実施希望調書!AA69","【様式２・３】実施希望調書!F70","【様式２・３】実施希望調書!N70","【様式２・３】実施希望調書!S70","【様式２・３】実施希望調書!X70","【様式２・３】実施希望調書!AA70","【様式２・３】実施希望調書!F71","【様式２・３】実施希望調書!N71","【様式２・３】実施希望調書!S71","【様式２・３】実施希望調書!X71","【様式２・３】実施希望調書!AA71","【様式２・３】実施希望調書!F72","【様式２・３】実施希望調書!N72","【様式２・３】実施希望調書!S72","【様式２・３】実施希望調書!X72","【様式２・３】実施希望調書!AA72","【様式２・３】実施希望調書!F73","【様式２・３】実施希望調書!N73","【様式２・３】実施希望調書!S73","【様式２・３】実施希望調書!X73","【様式２・３】実施希望調書!AA73","【様式２・３】実施希望調書!F74","【様式２・３】実施希望調書!N74","【様式２・３】実施希望調書!S74","【様式２・３】実施希望調書!X74","【様式２・３】実施希望調書!AA74","【様式２・３】実施希望調書!F75","【様式２・３】実施希望調書!N75","【様式２・３】実施希望調書!S75","【様式２・３】実施希望調書!X75","【様式２・３】実施希望調書!AA75","【様式２・３】実施希望調書!F76","【様式２・３】実施希望調書!AA76","【様式２・３】実施希望調書!B78","【様式２・３】実施希望調書!M102","【様式２・３】実施希望調書!S102","【様式２・３】実施希望調書!Y115","【様式２・３】実施希望調書!S120","【様式１】実施希望調書!S10","【様式１】実施希望調書!T10","【様式１】実施希望調書!U10","【様式１】実施希望調書!V10","【様式１】実施希望調書!W10","【様式１】実施希望調書!X8"]
[null,null,null,null,null,null,null,{"$f":"【様式２・３】実施希望調書!U1","v":0},null,{"$f":"【様式２・３】実施希望調書!E7","v":"○○市立文化小学校"},{"$f":"【様式２・３】実施希望調書!E6","v":"○○しりつ　ぶんか　しょうがっこう"},{"$f":"【様式２・３】実施希望調書!W6","v":300},{"$f":"【様式２・３】実施希望調書!F8","v":"***"},{"$f":"【様式２・３】実施希望調書!J8","v":"****"},{"$f":"【様式２・３】実施希望調書!P8","v":"北海道"},{"$f":"【様式２・３】実施希望調書!E9","v":"○○市　△△　1-1-1"},{"$f":"【様式２・３】実施希望調書!W8","v":"◇◇　◇◇"},{"$f":"【様式２・３】実施希望調書!W9","v":"□□　□□"},{"$f":"【様式２・３】実施希望調書!E10","v":"00-0000-0000"},{"$f":"【様式２・３】実施希望調書!N10","v":"00-0000-1111"},{"$f":"【様式２・３】実施希望調書!W10","v":"xxx@xxxx.xx.xx"},{"$f":"【様式２・３】実施希望調書!E10","v":"00-0000-0000"},{"$f":"【様式２・３】実施希望調書!W11","v":"なし"},{"$f":"【様式２・３】実施希望調書!E13","v":"音楽"},{"$f":"【様式２・３】実施希望調書!I13","v":"C　弦楽器"},{"$f":"【様式２・３】実施希望調書!F14","v":3},{"$f":"【様式２・３】実施希望調書!E16","v":"芸術　花子"},{"$f":"【様式２・３】実施希望調書!E15","v":"げいじゅつ　はなこ"},{"$f":"【様式２・３】実施希望調書!W15","v":"●●室内管弦楽団"},{"$f":"【様式２・３】実施希望調書!E17","v":"卒業生"},{"$f":"【様式２・３】実施希望調書!S17","v":0},{"$f":"【様式２・３】実施希望調書!E18","v":"登録済み"},{"$f":"【様式２・３】実施希望調書!U18","v":2},{"$f":"【様式２・３】実施希望調書!AA18","v":4},{"$f":"【様式２・３】実施希望調書!AB20","v":"確認済み"},{"$f":"【様式２・３】実施希望調書!E22","v":"希望する講師が芸術分野以外にも申請校が求める専門スキルを所有しており他の講師での実施が困難（福祉現場での活動経験が豊富等）"},{"$f":"【様式２・３】実施希望調書!E24","v":"本校では毎年、芸術文化の鑑賞や活動体験を通して、子供たちの豊かな情操を育み、芸術に親しむ感性を養うことを目的として芸術家の派遣事業を活用している。本校の児童の特性として、発達に困難を抱えた児童が多く、毎年異なる講師を迎えることは、子供たちへ不安や緊張といったストレスをかける要因となり、本来の目的達成に支障が生じてしまう。本校が希望する○○先生は本校の児童の特性に深く理解があり、教員側・保護者側からも安心して実施をお任せできることから、令和4年度も継続して○○先生を講師に迎えることを希望する。"},{"$f":"【様式２・３】実施希望調書!E25","v":"2022-06-10"},{"$f":"【様式２・３】実施希望調書!S25","v":"午前"},{"$f":"【様式２・３】実施希望調書!AA25","v":90},{"$f":"【様式２・３】実施希望調書!E26","v":"有"},{"$f":"【様式２・３】実施希望調書!O26","v":"北海道"},{"$f":"【様式２・３】実施希望調書!V26","v":"◎◎市立芸術中学校"},{"$f":"【様式２・３】実施希望調書!E27","v":"教科"},{"$f":"【様式２・３】実施希望調書!S27","v":"音楽"},{"$f":"【様式２・３】実施希望調書!E28","v":"許諾が必要"},{"$f":"【様式２・３】実施希望調書!V28","v":"許諾取得済み"},{"$f":"【様式２・３】実施希望調書!G29","v":100},{"$f":"【様式２・３】実施希望調書!P29","v":"学年単位"},{"$f":"【様式２・３】実施希望調書!S30","v":"5，6年生"},{"$f":"【様式２・３】実施希望調書!F32","v":"次代　太郎"},{"$f":"【様式２・３】実施希望調書!N32","v":1},{"$f":"【様式２・３】実施希望調書!S32","v":1},{"$f":"【様式２・３】実施希望調書!X32","v":0},{"$f":"【様式２・３】実施希望調書!AA32","v":11720},{"$f":"【様式２・３】実施希望調書!F33","v":"音楽　花子"},{"$f":"【様式２・３】実施希望調書!N33","v":1},{"$f":"【様式２・３】実施希望調書!S33","v":1},{"$f":"【様式２・３】実施希望調書!X33","v":0},{"$f":"【様式２・３】実施希望調書!AA33","v":11720},{"$f":"【様式２・３】実施希望調書!F34","v":"演奏　太郎"},{"$f":"【様式２・３】実施希望調書!N34","v":1},{"$f":"【様式２・３】実施希望調書!S34","v":1},{"$f":"【様式２・３】実施希望調書!X34","v":0},{"$f":"【様式２・３】実施希望調書!AA34","v":11720},{"$f":"【様式２・３】実施希望調書!F35","v":0},{"$f":"【様式２・３】実施希望調書!N35","v":0},{"$f":"【様式２・３】実施希望調書!S35","v":0},{"$f":"【様式２・３】実施希望調書!X35","v":0},{"$f":"【様式２・３】実施希望調書!AA35","v":0},{"$f":"【様式２・３】実施希望調書!F36","v":0},{"$f":"【様式２・３】実施希望調書!N36","v":0},{"$f":"【様式２・３】実施希望調書!S36","v":0},{"$f":"【様式２・３】実施希望調書!X36","v":0},{"$f":"【様式２・３】実施希望調書!AA36","v":0},{"$f":"【様式２・３】実施希望調書!F37","v":0},{"$f":"【様式２・３】実施希望調書!N37","v":0},{"$f":"【様式２・３】実施希望調書!S37","v":0},{"$f":"【様式２・３】実施希望調書!X37","v":0},{"$f":"【様式２・３】実施希望調書!AA37","v":0},{"$f":"【様式２・３】実施希望調書!F38","v":0},{"$f":"【様式２・３】実施希望調書!N38","v":0},{"$f":"【様式２・３】実施希望調書!S38","v":0},{"$f":"【様式２・３】実施希望調書!X38","v":0},{"$f":"【様式２・３】実施希望調書!AA38","v":0},{"$f":"【様式２・３】実施希望調書!F39","v":0},{"$f":"【様式２・３】実施希望調書!N39","v":0},{"$f":"【様式２・３】実施希望調書!S39","v":0},{"$f":"【様式２・３】実施希望調書!X39","v":0},{"$f":"【様式２・３】実施希望調書!AA39","v":0},{"$f":"【様式２・３】実施希望調書!F40","v":3},{"$f":"【様式２・３】実施希望調書!AA40","v":35160},{"$f":"【様式２・３】実施希望調書!B42","v":"○○○○○○○○○○○○○○○○○○○○○○○○○○○○○○○○○○○○○○○○○○○○○○○○○○○○○○○○○○○○○○○○○○○○○○○○○○○○○○○○○○○○○○○○○○○○○○○○○○○○○○○○○○○○○○○○○○○○○○○○○○○○○○○○○○○○○○○○○○○○○○○○○○○○○○○○○○○○○○○○○○○○○○○○○○○○"},{"$f":"【様式２・３】実施希望調書!E43","v":"2022-06-17"},{"$f":"【様式２・３】実施希望調書!S43","v":"午後"},{"$f":"【様式２・３】実施希望調書!AA43","v":150},{"$f":"【様式２・３】実施希望調書!E44","v":"無"},{"$f":"【様式２・３】実施希望調書!O44","v":0},{"$f":"【様式２・３】実施希望調書!V44","v":0},{"$f":"【様式２・３】実施希望調書!E45","v":"総合的な学習の時間"},{"$f":"【様式２・３】実施希望調書!S45","v":0},{"$f":"【様式２・３】実施希望調書!E46","v":"許諾は不要"},{"$f":"【様式２・３】実施希望調書!V46","v":0},{"$f":"【様式２・３】実施希望調書!G47","v":100},{"$f":"【様式２・３】実施希望調書!P47","v":"学年単位"},{"$f":"【様式２・３】実施希望調書!S48","v":"5，6年生"},{"$f":"【様式２・３】実施希望調書!F50","v":"次代　太郎"},{"$f":"【様式２・３】実施希望調書!N50","v":2},{"$f":"【様式２・３】実施希望調書!S50","v":1},{"$f":"【様式２・３】実施希望調書!X50","v":0},{"$f":"【様式２・３】実施希望調書!AA50","v":18240},{"$f":"【様式２・３】実施希望調書!F51","v":"音楽　花子"},{"$f":"【様式２・３】実施希望調書!N51","v":2},{"$f":"【様式２・３】実施希望調書!S51","v":1},{"$f":"【様式２・３】実施希望調書!X51","v":0},{"$f":"【様式２・３】実施希望調書!AA51","v":18240},{"$f":"【様式２・３】実施希望調書!F52","v":"演奏　太郎"},{"$f":"【様式２・３】実施希望調書!N52","v":2},{"$f":"【様式２・３】実施希望調書!S52","v":1},{"$f":"【様式２・３】実施希望調書!X52","v":0},{"$f":"【様式２・３】実施希望調書!AA52","v":18240},{"$f":"【様式２・３】実施希望調書!F53","v":""},{"$f":"【様式２・３】実施希望調書!N53","v":0},{"$f":"【様式２・３】実施希望調書!S53","v":0},{"$f":"【様式２・３】実施希望調書!X53","v":0},{"$f":"【様式２・３】実施希望調書!AA53","v":0},{"$f":"【様式２・３】実施希望調書!F54","v":""},{"$f":"【様式２・３】実施希望調書!N54","v":0},{"$f":"【様式２・３】実施希望調書!S54","v":0},{"$f":"【様式２・３】実施希望調書!X54","v":0},{"$f":"【様式２・３】実施希望調書!AA54","v":0},{"$f":"【様式２・３】実施希望調書!F55","v":""},{"$f":"【様式２・３】実施希望調書!N55","v":0},{"$f":"【様式２・３】実施希望調書!S55","v":0},{"$f":"【様式２・３】実施希望調書!X55","v":0},{"$f":"【様式２・３】実施希望調書!AA55","v":0},{"$f":"【様式２・３】実施希望調書!F56","v":""},{"$f":"【様式２・３】実施希望調書!N56","v":0},{"$f":"【様式２・３】実施希望調書!S56","v":0},{"$f":"【様式２・３】実施希望調書!X56","v":0},{"$f":"【様式２・３】実施希望調書!AA56","v":0},{"$f":"【様式２・３】実施希望調書!F57","v":""},{"$f":"【様式２・３】実施希望調書!N57","v":0},{"$f":"【様式２・３】実施希望調書!S57","v":0},{"$f":"【様式２・３】実施希望調書!X57","v":0},{"$f":"【様式２・３】実施希望調書!AA57","v":0},{"$f":"【様式２・３】実施希望調書!F58","v":3},{"$f":"【様式２・３】実施希望調書!AA58","v":54720},{"$f":"【様式２・３】実施希望調書!B60","v":"○○○○○○○○○○○○○○○○○○○○○○○○○○○○○○○○○○○○○○○○○○○○○○○○○○○○○○○○○○○○○○○○○○○○○○○○○○○○○○○○○○○○○○○○○○○○○○○○○○○○○○○○○○○○○○○○○○○○○○○○○○○○○○○○○○○○○○○○○○○○○○○○○○○○○○○○○○○○○○○○○○○○○○○○○○○○"},{"$f":"【様式２・３】実施希望調書!E61","v":"2022-06-23"},{"$f":"【様式２・３】実施希望調書!S61","v":"午前と午後"},{"$f":"【様式２・３】実施希望調書!AA61","v":150},{"$f":"【様式２・３】実施希望調書!E62","v":"無"},{"$f":"【様式２・３】実施希望調書!O62","v":0},{"$f":"【様式２・３】実施希望調書!V62","v":0},{"$f":"【様式２・３】実施希望調書!E63","v":"特別活動"},{"$f":"【様式２・３】実施希望調書!S63","v":"文化的行事"},{"$f":"【様式２・３】実施希望調書!E64","v":"許諾が必要"},{"$f":"【様式２・３】実施希望調書!V64","v":"許諾未取得"},{"$f":"【様式２・３】実施希望調書!G65","v":300},{"$f":"【様式２・３】実施希望調書!P65","v":"全校児童/生徒"},{"$f":"【様式２・３】実施希望調書!S66","v":0},{"$f":"【様式２・３】実施希望調書!F68","v":"次代　太郎"},{"$f":"【様式２・３】実施希望調書!N68","v":2},{"$f":"【様式２・３】実施希望調書!S68","v":1},{"$f":"【様式２・３】実施希望調書!X68","v":0},{"$f":"【様式２・３】実施希望調書!AA68","v":18240},{"$f":"【様式２・３】実施希望調書!F69","v":"音楽　花子"},{"$f":"【様式２・３】実施希望調書!N69","v":2},{"$f":"【様式２・３】実施希望調書!S69","v":0},{"$f":"【様式２・３】実施希望調書!X69","v":0},{"$f":"【様式２・３】実施希望調書!AA69","v":13040},{"$f":"【様式２・３】実施希望調書!F70","v":"演奏　太郎"},{"$f":"【様式２・３】実施希望調書!N70","v":2},{"$f":"【様式２・３】実施希望調書!S70","v":0},{"$f":"【様式２・３】実施希望調書!X70","v":0},{"$f":"【様式２・３】実施希望調書!AA70","v":13040},{"$f":"【様式２・３】実施希望調書!F71","v":"弦楽　花子"},{"$f":"【様式２・３】実施希望調書!N71","v":2},{"$f":"【様式２・３】実施希望調書!S71","v":0},{"$f":"【様式２・３】実施希望調書!X71","v":0},{"$f":"【様式２・３】実施希望調書!AA71","v":13040},{"$f":"【様式２・３】実施希望調書!F72","v":"鍵盤　太郎"},{"$f":"【様式２・３】実施希望調書!N72","v":2},{"$f":"【様式２・３】実施希望調書!S72","v":0},{"$f":"【様式２・３】実施希望調書!X72","v":0},{"$f":"【様式２・３】実施希望調書!AA72","v":13040},{"$f":"【様式２・３】実施希望調書!F73","v":""},{"$f":"【様式２・３】実施希望調書!N73","v":0},{"$f":"【様式２・３】実施希望調書!S73","v":0},{"$f":"【様式２・３】実施希望調書!X73","v":0},{"$f":"【様式２・３】実施希望調書!AA73","v":0},{"$f":"【様式２・３】実施希望調書!F74","v":""},{"$f":"【様式２・３】実施希望調書!N74","v":0},{"$f":"【様式２・３】実施希望調書!S74","v":0},{"$f":"【様式２・３】実施希望調書!X74","v":0},{"$f":"【様式２・３】実施希望調書!AA74","v":0},{"$f":"【様式２・３】実施希望調書!F75","v":""},{"$f":"【様式２・３】実施希望調書!N75","v":0},{"$f":"【様式２・３】実施希望調書!S75","v":0},{"$f":"【様式２・３】実施希望調書!X75","v":0},{"$f":"【様式２・３】実施希望調書!AA75","v":0},{"$f":"【様式２・３】実施希望調書!F76","v":5},{"$f":"【様式２・３】実施希望調書!AA76","v":70400},{"$f":"【様式２・３】実施希望調書!B78","v":"○○○○○○○○○○○○○○○○○○○○○○○○○○○○○○○○○○○○○○○○○○○○○○○○○○○○○○○○○○○○○○○○○○○○○○○○○○○○○○○○○○○○○○○○○○○○○○○○○○○○○○○○○○○○○○○○○○○○○○○○○○○○○○○○○○○○○○○○○○○○○○○○○○○○○○○○○○○○○○○○○○○○○○○○○○○○"},{"$f":"【様式２・３】実施希望調書!M107","v":267230},{"$f":"【様式２・３】実施希望調書!S107","v":65590},{"$f":"【様式２・３】実施希望調書!Y122","v":48700},{"$f":"SUM(GX3:GZ3)","v":381520}]

{"sheet":"（様式9・10）集約用","index":16,"n_rows":2,"n_cols":194,"rows_kept":2,"cut":false,"hidden":true,"merged":[]}
["実施校ID","都道府県・\n政令指定都市","実施校名","学校長名","全校","担当者名","実施会場","TEL","他校との合同\n開催の状況","メール","講師氏名※本名","実施回数","効果・成果1","効果・成果2","効果・成果3","効果・成果4","効果・成果5","効果・成果6","効果・成果7","エピソード対象1(児童生徒）","エピソード対象2（教員）","エピソード対象3（学校全体）","エピソード対象4（その他）","エピソード本文","魅力本文","意見本文","第1回実施日","第1回実施時間","第1回実施時間計","第1回教科の位置づけ①","第1回教科の位置づけ②","第1回参加児童生徒合計","第1回参加単位①","第1回参加単位②","補助者①氏名1回目","補助者①演奏時間1回目","補助者①実技時間1回目","補助者①単労時間1回目","補助者①謝金合計1回目","補助者②氏名1回目","補助者②演奏時間1回目","補助者②実技時間1回目","補助者②単労時間1回目","補助者②謝金合計1回目","補助者③氏名1回目","補助者③演奏時間1回目","補助者③実技時間1回目","補助者③単労時間1回目","補助者③謝金合計1回目","補助者④氏名1回目","補助者④演奏時間1回目","補助者④実技時間1回目","補助者④単労時間1回目","補助者④謝金合計1回目","補助者⑤氏名1回目","補助者⑤演奏時間1回目","補助者⑤実技時間1回目","補助者⑤単労時間1回目","補助者⑤謝金合計1回目","補助者⑥氏名1回目","補助者⑥演奏時間1回目","補助者⑥実技時間1回目","補助者⑥単労時間1回目","補助者⑥謝金合計1回目","補助者⑦氏名1回目","補助者⑦演奏時間1回目","補助者⑦実技時間1回目","補助者⑦単労時間1回目","補助者⑦謝金合計1回目","補助者⑧氏名1回目","補助者⑧演奏時間1回目","補助者⑧実技時間1回目","補助者⑧単労時間1回目","補助者⑧謝金合計1回目","1回目補助者人数","1回目謝金合計","第1回事業内容","第1回児童生徒の反応等","第2回実施日","第2回実施時間","第2回実施時間計","第2回教科の位置づけ①","第2回教科の位置づけ②","第2回参加児童生徒合計","第2回参加単位①","第2回参加単位②","補助者①氏名2回目","補助者①演奏時間2回目","補助者①実技時間2回目","補助者①単労時間2回目","補助者①謝金合計2回目","補助者②氏名2回目","補助者②演奏時間2回目","補助者②実技時間2回目","補助者②単労時間2回目","補助者②謝金合計2回目","補助者③氏名2回目","補助者③演奏時間2回目","補助者③実技時間2回目","補助者③単労時間2回目","補助者③謝金合計2回目","補助者④氏名2回目","補助者④演奏時間2回目","補助者④実技時間2回目","補助者④単労時間2回目","補助者④謝金合計2回目","補助者⑤氏名2回目","補助者⑤演奏時間2回目","補助者⑤実技時間2回目","補助者⑤単労時間2回目","補助者⑤謝金合計2回目","補助者⑥氏名2回目","補助者⑥演奏時間2回目","補助者⑥実技時間2回目","補助者⑥単労時間2回目","補助者⑥謝金合計2回目","補助者⑦氏名2回目","補助者⑦演奏時間2回目","補助者⑦実技時間2回目","補助者⑦単労時間2回目","補助者⑦謝金合計2回目","補助者⑧氏名2回目","補助者⑧演奏時間2回目","補助者⑧実技時間2回目","補助者⑧単労時間2回目","補助者⑧謝金合計2回目","2回目補助者人数","2回目謝金合計","第2回事業内容","第2回児童生徒の反応等","第3回実施日","第3回実施時間","第3回実施時間計","第3回教科の位置づけ①","第3回教科の位置づけ②","第3回参加児童生徒合計","第3回参加単位①","第3回参加単位②","補助者①氏名3回目","補助者①演奏時間3回目","補助者①実技時間3回目","補助者①単労時間3回目","補助者①謝金合計3回目","補助者②氏名3回目","補助者②演奏時間3回目","補助者②実技時間3回目","補助者②単労時間3回目","補助者②謝金合計3回目","補助者③氏名3回目","補助者③演奏時間3回目","補助者③実技時間3回目","補助者③単労時間3回目","補助者③謝金合計3回目","補助者④氏名3回目","補助者④演奏時間3回目","補助者④実技時間3回目","補助者④単労時間3回目","補助者④謝金合計3回目","補助者⑤氏名3回目","補助者⑤演奏時間3回目","補助者⑤実技時間3回目","補助者⑤単労時間3回目","補助者⑤謝金合計3回目","補助者⑥氏名3回目","補助者⑥演奏時間3回目","補助者⑥実技時間3回目","補助者⑥単労時間3回目","補助者⑥謝金合計3回目","補助者⑦氏名3回目","補助者⑦演奏時間3回目","補助者⑦実技時間3回目","補助者⑦単労時間3回目","補助者⑦謝金合計3回目","補助者⑧氏名3回目","補助者⑧演奏時間3回目","補助者⑧実技時間3回目","補助者⑧単労時間3回目","補助者⑧謝金合計3回目","3回目補助者人数","3回目謝金合計","第3回事業内容","第3回児童生徒の反応等","謝金","旅費","諸雑費","決算額計","大項目","中項目","補助者人数（のべ人数）","参加児童生徒（のべ人数）","宮古島","奄美\n・\n小笠原","特別支援・盲・聾学校","備考"]
["=【様式9・10】実施報告書!F5","=【様式9・10】実施報告書!U5","=【様式9・10】実施報告書!F6","=【様式9・10】実施報告書!U6","=【様式9・10】実施報告書!F7","=【様式9・10】実施報告書!U7","=【様式9・10】実施報告書!F8","=【様式9・10】実施報告書!U8","=【様式9・10】実施報告書!I9","=【様式9・10】実施報告書!U9","=【様式9・10】実施報告書!F10","=【様式9・10】実施報告書!U10","=【様式9・10】実施報告書!C13","=【様式9・10】実施報告書!C14","=【様式9・10】実施報告書!C15","=【様式9・10】実施報告書!C16","=【様式9・10】実施報告書!C17","=【様式9・10】実施報告書!C18","=【様式9・10】実施報告書!C19","=【様式9・10】実施報告書!C24","=【様式9・10】実施報告書!K24","=【様式9・10】実施報告書!R24","=【様式9・10】実施報告書!Z24","=【様式9・10】実施報告書!A26","=【様式9・10】実施報告書!A28","=【様式9・10】実施報告書!A30","＝【様式9・10】実施報告書!E34","＝【様式9・10】実施報告書!S34","＝【様式9・10】実施報告書!AA34","＝【様式9・10】実施報告書!E35","=【様式9・10】実施報告書!S35","=【様式9・10】実施報告書!G36","=【様式9・10】実施報告書!P36","＝【様式9・10】実施報告書!S37","=【様式9・10】実施報告書!F39","=【様式9・10】実施報告書!N39","=【様式9・10】実施報告書!S39","=【様式9・10】実施報告書!X39","=【様式9・10】実施報告書!AA39","=【様式9・10】実施報告書!F40","=【様式9・10】実施報告書!N40","=【様式9・10】実施報告書!S40","=【様式9・10】実施報告書!X40","=【様式9・10】実施報告書!AA40","=【様式9・10】実施報告書!F41","=【様式9・10】実施報告書!N41","=【様式9・10】実施報告書!S41","=【様式9・10】実施報告書!X41","=【様式9・10】実施報告書!AA41","=【様式9・10】実施報告書!F42","=【様式9・10】実施報告書!N42","=【様式9・10】実施報告書!S42","=【様式9・10】実施報告書!X42","=【様式9・10】実施報告書!AA42","=【様式9・10】実施報告書!F43","=【様式9・10】実施報告書!N43","=【様式9・10】実施報告書!S43","=【様式9・10】実施報告書!X43","=【様式9・10】実施報告書!AA43","=【様式9・10】実施報告書!F44","=【様式9・10】実施報告書!N44","=【様式9・10】実施報告書!S44","=【様式9・10】実施報告書!X44","=【様式9・10】実施報告書!AA44","=【様式9・10】実施報告書!F45","=【様式9・10】実施報告書!N45","=【様式9・10】実施報告書!S45","=【様式9・10】実施報告書!X45","=【様式9・10】実施報告書!AA45","=【様式9・10】実施報告書!F46","=【様式9・10】実施報告書!N46","=【様式9・10】実施報告書!S46","=【様式9・10】実施報告書!X46","=【様式9・10】実施報告書!AA46","=【様式9・10】実施報告書!F47","=【様式9・10】実施報告書!AA47","=【様式9・10】実施報告書!B49","=【様式9・10】実施報告書!B51","=【様式9・10】実施報告書!E52","=【様式9・10】実施報告書!S52","=【様式9・10】実施報告書!AA52","=【様式9・10】実施報告書!E53","=【様式9・10】実施報告書!S53","=【様式9・10】実施報告書!G54","=【様式9・10】実施報告書!P54","=【様式9・10】実施報告書!S55","=【様式9・10】実施報告書!F57","=【様式9・10】実施報告書!N57","=【様式9・10】実施報告書!S57","=【様式9・10】実施報告書!X57","=【様式9・10】実施報告書!AA57","=【様式9・10】実施報告書!F58","=【様式9・10】実施報告書!N58","=【様式9・10】実施報告書!S58","=【様式9・10】実施報告書!X58","=【様式9・10】実施報告書!AA58","=【様式9・10】実施報告書!F59","=【様式9・10】実施報告書!N59","=【様式9・10】実施報告書!S59","=【様式9・10】実施報告書!X59","=【様式9・10】実施報告書!AA59","=【様式9・10】実施報告書!F60","=【様式9・10】実施報告書!N60","=【様式9・10】実施報告書!S60","=【様式9・10】実施報告書!X60","=【様式9・10】実施報告書!AA60","=【様式9・10】実施報告書!F61","=【様式9・10】実施報告書!N61","=【様式9・10】実施報告書!S61","=【様式9・10】実施報告書!X61","=【様式9・10】実施報告書!AA61","=【様式9・10】実施報告書!F62","=【様式9・10】実施報告書!N62","=【様式9・10】実施報告書!S62","=【様式9・10】実施報告書!X62","=【様式9・10】実施報告書!AA62","=【様式9・10】実施報告書!F63","=【様式9・10】実施報告書!N63","=【様式9・10】実施報告書!S63","=【様式9・10】実施報告書!X63","=【様式9・10】実施報告書!AA63","=【様式9・10】実施報告書!F64","=【様式9・10】実施報告書!N64","=【様式9・10】実施報告書!S64","=【様式9・10】実施報告書!X64","=【様式9・10】実施報告書!AA64","=【様式9・10】実施報告書!F65","=【様式9・10】実施報告書!AA65","=【様式9・10】実施報告書!B67","=【様式9・10】実施報告書!B69","=【様式9・10】実施報告書!E72","=【様式9・10】実施報告書!S72","=【様式9・10】実施報告書!AA72","=【様式9・10】実施報告書!E73","=【様式9・10】実施報告書!S73","=【様式9・10】実施報告書!G74","=【様式9・10】実施報告書!P74","=【様式9・10】実施報告書!S75","=【様式9・10】実施報告書!F77","=【様式9・10】実施報告書!N77","=【様式9・10】実施報告書!S77","=【様式9・10】実施報告書!X77","=【様式9・10】実施報告書!AA77","=【様式9・10】実施報告書!F78","=【様式9・10】実施報告書!N78","=【様式9・10】実施報告書!S78","=【様式9・10】実施報告書!X78","=【様式9・10】実施報告書!AA78","=【様式9・10】実施報告書!F79","=【様式9・10】実施報告書!N79","=【様式9・10】実施報告書!S79","=【様式9・10】実施報告書!X79","=【様式9・10】実施報告書!AA79","=【様式9・10】実施報告書!F80","=【様式9・10】実施報告書!N80","=【様式9・10】実施報告書!S80","=【様式9・10】実施報告書!X80","=【様式9・10】実施報告書!AA80","=【様式9・10】実施報告書!F81","=【様式9・10】実施報告書!N81","=【様式9・10】実施報告書!S81","=【様式9・10】実施報告書!X81","=【様式9・10】実施報告書!AA81","=【様式9・10】実施報告書!F82","=【様式9・10】実施報告書!N82","=【様式9・10】実施報告書!S82","=【様式9・10】実施報告書!X82","=【様式9・10】実施報告書!AA82","=【様式9・10】実施報告書!F83","=【様式9・10】実施報告書!N83","=【様式9・10】実施報告書!S83","=【様式9・10】実施報告書!X83","=【様式9・10】実施報告書!AA83","=【様式9・10】実施報告書!F84","=【様式9・10】実施報告書!N84","=【様式9・10】実施報告書!S84","=【様式9・10】実施報告書!X84","=【様式9・10】実施報告書!AA84","=【様式9・10】実施報告書!F85","=【様式9・10】実施報告書!AA85","=【様式9・10】実施報告書!B87","=【様式9・10】実施報告書!B89","=【様式9・10】実施報告書!N98","=【様式9・10】実施報告書!N99","=【様式9・10】実施報告書!N100","=【様式9・10】実施報告書!M101","=【様式２・３】実施希望調書!E13","=【様式２・３】実施希望調書!I13","=BW2+DW2+FW2","=AF2+CF2+EF2"]

{"sheet":"選択肢","index":17,"n_rows":69,"n_cols":45,"rows_kept":69,"cut":false,"hidden":true,"merged":[[24,36,24,39],[24,41,24,44]]}
[null,null,null,null,null,null,null,null,null,null,null,null,null,null,null,null,null,null,null,null,null,null,null,null,null,"教科の位置付け",null,"教科名",null,null,"全校児童/生徒",null,"会場",null,null,null,"1-1",{"$f":"IF(【様式２・３】実施希望調書!F32=\"\",\"\",【様式２・３】実施希望調書!F32)","v":"次代　太郎"},{"$f":"IF(AL1=\"\",\"\",IF(COUNTIF($AL$1:AL1,AL1)=1,AL1,\"\"))","v":"次代　太郎"},{"$f":"IFERROR(INDEX(AM:AM,SMALL(IF(AM:AM<>\"\",ROW(AM:AM)),ROW(AM1))),\"\")","v":"次代　太郎"},null,"1-1",{"$f":"IF(【様式９・１０】実施報告書!F39=\"\",\"\",【様式９・１０】実施報告書!F39)","v":"次代　太郎"},{"$f":"IF(AQ1=\"\",\"\",IF(COUNTIF($AQ$1:AQ1,AQ1)=1,AQ1,\"\"))","v":"次代　太郎"},{"$f":"IFERROR(INDEX(AR:AR,SMALL(IF(AR:AR<>\"\",ROW(AR:AR)),ROW(AR1))),\"\")","v":"次代　太郎"}]
[null,null,null,"音楽","演劇","舞踊","大衆芸能","美術","伝統芸能","文学","生活文化","メディア芸術",null,"NO","都道府県",null,"理由","学年単位","その他",null,null,null,null,null,null,"教科","教科名","国語",null,null,"学年単位","内訳","実施校の教室・体育館",null,null,null,"1-2",{"$f":"IF(【様式２・３】実施希望調書!F33=\"\",\"\",【様式２・３】実施希望調書!F33)","v":"音楽　花子"},{"$f":"IF(AL2=\"\",\"\",IF(COUNTIF($AL$1:AL2,AL2)=1,AL2,\"\"))","v":"音楽　花子"},{"$f":"IFERROR(INDEX(AM:AM,SMALL(IF(AM:AM<>\"\",ROW(AM:AM)),ROW(AM2))),\"\")","v":"音楽　花子"},null,"1-2",{"$f":"IF(【様式９・１０】実施報告書!F40=\"\",\"\",【様式９・１０】実施報告書!F40)","v":"音楽　花子"},{"$f":"IF(AQ2=\"\",\"\",IF(COUNTIF($AQ$1:AQ2,AQ2)=1,AQ2,\"\"))","v":"音楽　花子"},{"$f":"IFERROR(INDEX(AR:AR,SMALL(IF(AR:AR<>\"\",ROW(AR:AR)),ROW(AR2))),\"\")","v":"音楽　花子"}]
[1,"音楽",null,"A　ピアノ","A　現代劇","A　バレエ","A　落語","A　洋画","A　歌舞伎","A　俳句","A　囲碁","A　メディアアート",null,1,"北海道",null,"希望する講師が芸術分野以外にも申請校が求める専門スキルを所有しており他の講師での実施が困難（福祉現場での活動経験が豊富等）","1年生","参加単位を記入してください",null,null,null,null,null,null,"道徳","　","社会",null,null,"学級単位","内訳","合同開催校の教室・体育館",null,null,null,"1-3",{"$f":"IF(【様式２・３】実施希望調書!F34=\"\",\"\",【様式２・３】実施希望調書!F34)","v":"演奏　太郎"},{"$f":"IF(AL3=\"\",\"\",IF(COUNTIF($AL$1:AL3,AL3)=1,AL3,\"\"))","v":"演奏　太郎"},{"$f":"IFERROR(INDEX(AM:AM,SMALL(IF(AM:AM<>\"\",ROW(AM:AM)),ROW(AM3))),\"\")","v":"演奏　太郎"},null,"1-3",{"$f":"IF(【様式９・１０】実施報告書!F41=\"\",\"\",【様式９・１０】実施報告書!F41)","v":"演奏　太郎"},{"$f":"IF(AQ3=\"\",\"\",IF(COUNTIF($AQ$1:AQ3,AQ3)=1,AQ3,\"\"))","v":"演奏　太郎"},{"$f":"IFERROR(INDEX(AR:AR,SMALL(IF(AR:AR<>\"\",ROW(AR:AR)),ROW(AR3))),\"\")","v":"演奏　太郎"}]
[2,"演劇",null,"B　声楽","B　ミュージカル","B　現代舞踊","B　講談","B　日本画","B　能楽","B　朗読","B　将棋","B　映画",null,2,"青森県",null,"希望する分野専門の講師が他にいないため","2年生",null,null,null,null,null,null,null,"総合的な学習の時間","　","算数／数学",null,null,"その他","内訳","文化施設等",null,null,null,"1-4",{"$f":"IF(【様式２・３】実施希望調書!F35=\"\",\"\",【様式２・３】実施希望調書!F35)","v":""},{"$f":"IF(AL4=\"\",\"\",IF(COUNTIF($AL$1:AL4,AL4)=1,AL4,\"\"))","v":""},{"$f":"IFERROR(INDEX(AM:AM,SMALL(IF(AM:AM<>\"\",ROW(AM:AM)),ROW(AM4))),\"\")","v":"弦楽　花子"},null,"1-4",{"$f":"IF(【様式９・１０】実施報告書!F42=\"\",\"\",【様式９・１０】実施報告書!F42)","v":""},{"$f":"IF(AQ4=\"\",\"\",IF(COUNTIF($AQ$1:AQ4,AQ4)=1,AQ4,\"\"))","v":""},{"$f":"IFERROR(INDEX(AR:AR,SMALL(IF(AR:AR<>\"\",ROW(AR:AR)),ROW(AR4))),\"\")","v":"弦楽　花子"}]
[3,"舞踊",null,"C　弦楽器","C　人形劇","C　身体表現","C　漫才","C　版画","C　人形浄瑠璃","C　その他","C　華道","C　アニメーション",null,3,"岩手県",null,"申請校に音楽専科・美術専科の教員がいないため","3年生",null,null,null,null,null,null,null,"特別活動","特別活動名","理科",null,null,null,null,null,null,null,null,"1-5",{"$f":"IF(【様式２・３】実施希望調書!F36=\"\",\"\",【様式２・３】実施希望調書!F36)","v":""},{"$f":"IF(AL5=\"\",\"\",IF(COUNTIF($AL$1:AL5,AL5)=1,AL5,\"\"))","v":""},{"$f":"IFERROR(INDEX(AM:AM,SMALL(IF(AM:AM<>\"\",ROW(AM:AM)),ROW(AM5))),\"\")","v":"鍵盤　太郎"},null,"1-5",{"$f":"IF(【様式９・１０】実施報告書!F43=\"\",\"\",【様式９・１０】実施報告書!F43)","v":""},{"$f":"IF(AQ5=\"\",\"\",IF(COUNTIF($AQ$1:AQ5,AQ5)=1,AQ5,\"\"))","v":""},{"$f":"IFERROR(INDEX(AR:AR,SMALL(IF(AR:AR<>\"\",ROW(AR:AR)),ROW(AR5))),\"\")","v":"鍵盤　太郎"}]
[4,"大衆芸能",null,"D　パーカッション","D　その他","D　その他","D　浪曲","D　彫刻","D　日本舞踊",null,"D　茶道","D　マンガ",null,4,"宮城県",null,"その他","4年生",null,null,null,null,null,null,null,"その他","その他位置付け","生活",null,null,null,null,null,null,null,null,"1-6",{"$f":"IF(OR(OR(AND(【様式２・３】実施希望調書!$E$11=\"文化施設等\",【様式２・３】実施希望調書!$W$11=\"\"),AND(【様式２・３】実施希望調書!$E$11=\"文化施設等\",【様式２・３】実施希望調書!$W$11=\"なし\"),【様式２・３】実施希望調書!$E$11<>\"文化施設等\")),\"\",IF(【様式２・３】実施希望調書!F37=\"\",\"\",【様式２・３】実施希望調書!F37))","v":""},{"$f":"IF(AL6=\"\",\"\",IF(COUNTIF($AL$1:AL6,AL6)=1,AL6,\"\"))","v":""},{"$f":"IFERROR(INDEX(AM:AM,SMALL(IF(AM:AM<>\"\",ROW(AM:AM)),ROW(AM6))),\"\")","v":""},null,"1-6",{"$f":"IF(OR(OR(AND(【様式９・１０】実施報告書!$F$8=\"文化施設等\",【様式９・１０】実施報告書!$I$9=\"\"),AND(【様式９・１０】実施報告書!$F$8=\"文化施設等\",【様式９・１０】実施報告書!$I$9=\"なし\"),【様式９・１０】実施報告書!$F$8<>\"文化施設等\")),\"\",IF(【様式９・１０】実施報告書!F44=\"\",\"\",【様式９・１０】実施報告書!F44))","v":""},{"$f":"IF(AQ6=\"\",\"\",IF(COUNTIF($AQ$1:AQ6,AQ6)=1,AQ6,\"\"))","v":""},{"$f":"IFERROR(INDEX(AR:AR,SMALL(IF(AR:AR<>\"\",ROW(AR:AR)),ROW(AR6))),\"\")","v":""}]
[5,"美術",null,"E　管楽器",null,null,"E　その他","E　書","E　和太鼓",null,"E　和装","E　その他",null,5,"秋田県",null,null,"5年生",null,null,null,null,null,null,null,null,null,"音楽",null,null,null,null,null,null,null,null,"1-7",{"$f":"IF(OR(OR(AND(【様式２・３】実施希望調書!$E$11=\"文化施設等\",【様式２・３】実施希望調書!$W$11=\"\"),AND(【様式２・３】実施希望調書!$E$11=\"文化施設等\",【様式２・３】実施希望調書!$W$11=\"なし\"),【様式２・３】実施希望調書!$E$11<>\"文化施設等\")),\"\",IF(【様式２・３】実施希望調書!F38=\"\",\"\",【様式２・３】実施希望調書!F38))","v":""},{"$f":"IF(AL7=\"\",\"\",IF(COUNTIF($AL$1:AL7,AL7)=1,AL7,\"\"))","v":""},{"$f":"IFERROR(INDEX(AM:AM,SMALL(IF(AM:AM<>\"\",ROW(AM:AM)),ROW(AM7))),\"\")","v":""},null,"1-7",{"$f":"IF(OR(OR(AND(【様式９・１０】実施報告書!$F$8=\"文化施設等\",【様式９・１０】実施報告書!$I$9=\"\"),AND(【様式９・１０】実施報告書!$F$8=\"文化施設等\",【様式９・１０】実施報告書!$I$9=\"なし\"),【様式９・１０】実施報告書!$F$8<>\"文化施設等\")),\"\",IF(【様式９・１０】実施報告書!F45=\"\",\"\",【様式９・１０】実施報告書!F45))","v":""},{"$f":"IF(AQ7=\"\",\"\",IF(COUNTIF($AQ$1:AQ7,AQ7)=1,AQ7,\"\"))","v":""},{"$f":"IFERROR(INDEX(AR:AR,SMALL(IF(AR:AR<>\"\",ROW(AR:AR)),ROW(AR7))),\"\")","v":""}]
[6,"伝統芸能",null,"F　その他",null,null,null,"F　写真","F　箏",null,"F　食文化",null,null,6,"山形県",null,null,"6年生",null,null,null,null,null,null,null,null,null,"美術",null,null,null,null,null,null,null,null,"1-8",{"$f":"IF(OR(OR(AND(【様式２・３】実施希望調書!$E$11=\"文化施設等\",【様式２・３】実施希望調書!$W$11=\"\"),AND(【様式２・３】実施希望調書!$E$11=\"文化施設等\",【様式２・３】実施希望調書!$W$11=\"なし\"),【様式２・３】実施希望調書!$E$11<>\"文化施設等\")),\"\",IF(【様式２・３】実施希望調書!F39=\"\",\"\",【様式２・３】実施希望調書!F39))","v":""},{"$f":"IF(AL8=\"\",\"\",IF(COUNTIF($AL$1:AL8,AL8)=1,AL8,\"\"))","v":""},{"$f":"IFERROR(INDEX(AM:AM,SMALL(IF(AM:AM<>\"\",ROW(AM:AM)),ROW(AM8))),\"\")","v":""},null,"1-8",{"$f":"IF(OR(OR(AND(【様式９・１０】実施報告書!$F$8=\"文化施設等\",【様式９・１０】実施報告書!$I$9=\"\"),AND(【様式９・１０】実施報告書!$F$8=\"文化施設等\",【様式９・１０】実施報告書!$I$9=\"なし\"),【様式９・１０】実施報告書!$F$8<>\"文化施設等\")),\"\",IF(【様式９・１０】実施報告書!F46=\"\",\"\",【様式９・１０】実施報告書!F46))","v":""},{"$f":"IF(AQ8=\"\",\"\",IF(COUNTIF($AQ$1:AQ8,AQ8)=1,AQ8,\"\"))","v":""},{"$f":"IFERROR(INDEX(AR:AR,SMALL(IF(AR:AR<>\"\",ROW(AR:AR)),ROW(AR8))),\"\")","v":""}]
[7,"文学",null,null,null,null,null,"G　その他","G　三味線",null,"G　その他",null,null,7,"福島県",null,null,"（　　）年生",null,null,null,null,null,null,null,null,null,"図画工作",null,null,null,null,null,null,null,null,"2-1",{"$f":"IF(【様式２・３】実施希望調書!F50=\"\",\"\",【様式２・３】実施希望調書!F50)","v":"次代　太郎"},{"$f":"IF(AL9=\"\",\"\",IF(COUNTIF($AL$1:AL9,AL9)=1,AL9,\"\"))","v":""},{"$f":"IFERROR(INDEX(AM:AM,SMALL(IF(AM:AM<>\"\",ROW(AM:AM)),ROW(AM9))),\"\")","v":""},null,"2-1",{"$f":"IF(【様式９・１０】実施報告書!F57=\"\",\"\",【様式９・１０】実施報告書!F57)","v":"次代　太郎"},{"$f":"IF(AQ9=\"\",\"\",IF(COUNTIF($AQ$1:AQ9,AQ9)=1,AQ9,\"\"))","v":""},{"$f":"IFERROR(INDEX(AR:AR,SMALL(IF(AR:AR<>\"\",ROW(AR:AR)),ROW(AR9))),\"\")","v":""}]
[8,"生活文化",null,null,null,null,null,null,"H　その他",null,null,null,null,8,"茨城県",null,null,null,null,null,null,null,null,null,null,null,null,"家庭・技術",null,null,null,null,null,null,null,null,"2-2",{"$f":"IF(【様式２・３】実施希望調書!F51=\"\",\"\",【様式２・３】実施希望調書!F51)","v":"音楽　花子"},{"$f":"IF(AL10=\"\",\"\",IF(COUNTIF($AL$1:AL10,AL10)=1,AL10,\"\"))","v":""},{"$f":"IFERROR(INDEX(AM:AM,SMALL(IF(AM:AM<>\"\",ROW(AM:AM)),ROW(AM10))),\"\")","v":""},null,"2-2",{"$f":"IF(【様式９・１０】実施報告書!F58=\"\",\"\",【様式９・１０】実施報告書!F58)","v":"音楽　花子"},{"$f":"IF(AQ10=\"\",\"\",IF(COUNTIF($AQ$1:AQ10,AQ10)=1,AQ10,\"\"))","v":""},{"$f":"IFERROR(INDEX(AR:AR,SMALL(IF(AR:AR<>\"\",ROW(AR:AR)),ROW(AR10))),\"\")","v":""}]
[9,"メディア芸術",null,null,null,null,null,null,null,null,null,null,null,9,"栃木県",null,null,null,null,null,null,null,null,null,null,null,null,"体育／保健体育",null,null,null,null,null,null,null,null,"2-3",{"$f":"IF(【様式２・３】実施希望調書!F52=\"\",\"\",【様式２・３】実施希望調書!F52)","v":"演奏　太郎"},{"$f":"IF(AL11=\"\",\"\",IF(COUNTIF($AL$1:AL11,AL11)=1,AL11,\"\"))","v":""},{"$f":"IFERROR(INDEX(AM:AM,SMALL(IF(AM:AM<>\"\",ROW(AM:AM)),ROW(AM11))),\"\")","v":""},null,"2-3",{"$f":"IF(【様式９・１０】実施報告書!F59=\"\",\"\",【様式９・１０】実施報告書!F59)","v":"演奏　太郎"},{"$f":"IF(AQ11=\"\",\"\",IF(COUNTIF($AQ$1:AQ11,AQ11)=1,AQ11,\"\"))","v":""},{"$f":"IFERROR(INDEX(AR:AR,SMALL(IF(AR:AR<>\"\",ROW(AR:AR)),ROW(AR11))),\"\")","v":""}]
[null,null,null,null,null,null,null,null,null,null,null,null,null,10,"群馬県",null,null,null,null,null,null,null,null,null,null,null,null,"外国語",null,null,null,null,null,null,null,null,"2-4",{"$f":"IF(【様式２・３】実施希望調書!F53=\"\",\"\",【様式２・３】実施希望調書!F53)","v":""},{"$f":"IF(AL12=\"\",\"\",IF(COUNTIF($AL$1:AL12,AL12)=1,AL12,\"\"))","v":""},{"$f":"IFERROR(INDEX(AM:AM,SMALL(IF(AM:AM<>\"\",ROW(AM:AM)),ROW(AM12))),\"\")","v":""},null,"2-4",{"$f":"IF(【様式９・１０】実施報告書!F60=\"\",\"\",【様式９・１０】実施報告書!F60)","v":""},{"$f":"IF(AQ12=\"\",\"\",IF(COUNTIF($AQ$1:AQ12,AQ12)=1,AQ12,\"\"))","v":""},{"$f":"IFERROR(INDEX(AR:AR,SMALL(IF(AR:AR<>\"\",ROW(AR:AR)),ROW(AR12))),\"\")","v":""}]
[null,null,null,null,null,null,null,null,null,null,null,null,null,11,"埼玉県",null,null,"学級単位",null,null,null,null,null,null,null,null,null,null,null,null,null,null,null,null,null,null,"2-5",{"$f":"IF(【様式２・３】実施希望調書!F54=\"\",\"\",【様式２・３】実施希望調書!F54)","v":""},{"$f":"IF(AL13=\"\",\"\",IF(COUNTIF($AL$1:AL13,AL13)=1,AL13,\"\"))","v":""},{"$f":"IFERROR(INDEX(AM:AM,SMALL(IF(AM:AM<>\"\",ROW(AM:AM)),ROW(AM13))),\"\")","v":""},null,"2-5",{"$f":"IF(【様式９・１０】実施報告書!F61=\"\",\"\",【様式９・１０】実施報告書!F61)","v":""},{"$f":"IF(AQ13=\"\",\"\",IF(COUNTIF($AQ$1:AQ13,AQ13)=1,AQ13,\"\"))","v":""},{"$f":"IFERROR(INDEX(AR:AR,SMALL(IF(AR:AR<>\"\",ROW(AR:AR)),ROW(AR13))),\"\")","v":""}]
[null,null,null,null,"航空機",null,null,null,null,null,null,null,null,12,"千葉県",null,null,"具体的な学級（1年1組　等）を記入してください",null,null,null,null,null,null,null,null,null,null,null,null,null,null,null,null,null,null,"2-6",{"$f":"IF(OR(OR(AND(【様式２・３】実施希望調書!$E$11=\"文化施設等\",【様式２・３】実施希望調書!$W$11=\"\"),AND(【様式２・３】実施希望調書!$E$11=\"文化施設等\",【様式２・３】実施希望調書!$W$11=\"なし\"),【様式２・３】実施希望調書!$E$11<>\"文化施設等\")),\"\",IF(【様式２・３】実施希望調書!F55=\"\",\"\",【様式２・３】実施希望調書!F55))","v":""},{"$f":"IF(AL14=\"\",\"\",IF(COUNTIF($AL$1:AL14,AL14)=1,AL14,\"\"))","v":""},{"$f":"IFERROR(INDEX(AM:AM,SMALL(IF(AM:AM<>\"\",ROW(AM:AM)),ROW(AM14))),\"\")","v":""},null,"2-6",{"$f":"IF(OR(OR(AND(【様式９・１０】実施報告書!$F$8=\"文化施設等\",【様式９・１０】実施報告書!$I$9=\"\"),AND(【様式９・１０】実施報告書!$F$8=\"文化施設等\",【様式９・１０】実施報告書!$I$9=\"なし\"),【様式９・１０】実施報告書!$F$8<>\"文化施設等\")),\"\",IF(【様式９・１０】実施報告書!F62=\"\",\"\",【様式９・１０】実施報告書!F62))","v":""},{"$f":"IF(AQ14=\"\",\"\",IF(COUNTIF($AQ$1:AQ14,AQ14)=1,AQ14,\"\"))","v":""},{"$f":"IFERROR(INDEX(AR:AR,SMALL(IF(AR:AR<>\"\",ROW(AR:AR)),ROW(AR14))),\"\")","v":""}]
[null,null,null,null,"JR特急あり",null,null,null,null,null,null,null,null,13,"東京都",null,null,null,null,null,null,null,null,null,null,"特別活動名","その他位置付け",null,null,null,null,null,null,null,null,null,"2-7",{"$f":"IF(OR(OR(AND(【様式２・３】実施希望調書!$E$11=\"文化施設等\",【様式２・３】実施希望調書!$W$11=\"\"),AND(【様式２・３】実施希望調書!$E$11=\"文化施設等\",【様式２・３】実施希望調書!$W$11=\"なし\"),【様式２・３】実施希望調書!$E$11<>\"文化施設等\")),\"\",IF(【様式２・３】実施希望調書!F56=\"\",\"\",【様式２・３】実施希望調書!F56))","v":""},{"$f":"IF(AL15=\"\",\"\",IF(COUNTIF($AL$1:AL15,AL15)=1,AL15,\"\"))","v":""},{"$f":"IFERROR(INDEX(AM:AM,SMALL(IF(AM:AM<>\"\",ROW(AM:AM)),ROW(AM15))),\"\")","v":""},null,"2-7",{"$f":"IF(OR(OR(AND(【様式９・１０】実施報告書!$F$8=\"文化施設等\",【様式９・１０】実施報告書!$I$9=\"\"),AND(【様式９・１０】実施報告書!$F$8=\"文化施設等\",【様式９・１０】実施報告書!$I$9=\"なし\"),【様式９・１０】実施報告書!$F$8<>\"文化施設等\")),\"\",IF(【様式９・１０】実施報告書!F63=\"\",\"\",【様式９・１０】実施報告書!F63))","v":""},{"$f":"IF(AQ15=\"\",\"\",IF(COUNTIF($AQ$1:AQ15,AQ15)=1,AQ15,\"\"))","v":""},{"$f":"IFERROR(INDEX(AR:AR,SMALL(IF(AR:AR<>\"\",ROW(AR:AR)),ROW(AR15))),\"\")","v":""}]
[null,null,null,null,"JR特急なし",null,null,null,null,null,null,null,null,14,"神奈川県",null,null,null,null,null,null,null,null,null,null,"特別活動名を入力してください","その他位置付けの内容を入力してください",null,null,null,null,null,null,null,null,null,"2-8",{"$f":"IF(OR(OR(AND(【様式２・３】実施希望調書!$E$11=\"文化施設等\",【様式２・３】実施希望調書!$W$11=\"\"),AND(【様式２・３】実施希望調書!$E$11=\"文化施設等\",【様式２・３】実施希望調書!$W$11=\"なし\"),【様式２・３】実施希望調書!$E$11<>\"文化施設等\")),\"\",IF(【様式２・３】実施希望調書!F57=\"\",\"\",【様式２・３】実施希望調書!F57))","v":""},{"$f":"IF(AL16=\"\",\"\",IF(COUNTIF($AL$1:AL16,AL16)=1,AL16,\"\"))","v":""},{"$f":"IFERROR(INDEX(AM:AM,SMALL(IF(AM:AM<>\"\",ROW(AM:AM)),ROW(AM16))),\"\")","v":""},null,"2-8",{"$f":"IF(OR(OR(AND(【様式９・１０】実施報告書!$F$8=\"文化施設等\",【様式９・１０】実施報告書!$I$9=\"\"),AND(【様式９・１０】実施報告書!$F$8=\"文化施設等\",【様式９・１０】実施報告書!$I$9=\"なし\"),【様式９・１０】実施報告書!$F$8<>\"文化施設等\")),\"\",IF(【様式９・１０】実施報告書!F64=\"\",\"\",【様式９・１０】実施報告書!F64))","v":""},{"$f":"IF(AQ16=\"\",\"\",IF(COUNTIF($AQ$1:AQ16,AQ16)=1,AQ16,\"\"))","v":""},{"$f":"IFERROR(INDEX(AR:AR,SMALL(IF(AR:AR<>\"\",ROW(AR:AR)),ROW(AR16))),\"\")","v":""}]
[null,null,null,null,"私鉄特急あり",null,null,null,null,null,null,null,null,15,"新潟県",null,null,null,null,null,null,null,null,null,null,null,null,null,null,null,null,null,null,null,null,null,"3-1",{"$f":"IF(【様式２・３】実施希望調書!F68=\"\",\"\",【様式２・３】実施希望調書!F68)","v":"次代　太郎"},{"$f":"IF(AL17=\"\",\"\",IF(COUNTIF($AL$1:AL17,AL17)=1,AL17,\"\"))","v":""},{"$f":"IFERROR(INDEX(AM:AM,SMALL(IF(AM:AM<>\"\",ROW(AM:AM)),ROW(AM17))),\"\")","v":""},null,"3-1",{"$f":"IF(【様式９・１０】実施報告書!F77=\"\",\"\",【様式９・１０】実施報告書!F77)","v":"次代　太郎"},{"$f":"IF(AQ17=\"\",\"\",IF(COUNTIF($AQ$1:AQ17,AQ17)=1,AQ17,\"\"))","v":""},{"$f":"IFERROR(INDEX(AR:AR,SMALL(IF(AR:AR<>\"\",ROW(AR:AR)),ROW(AR17))),\"\")","v":""}]
[null,null,null,null,"私鉄特急なし",null,null,null,null,null,null,null,null,16,"富山県",null,null,null,null,null,null,null,null,null,null,null,null,null,null,null,null,null,null,null,null,null,"3-2",{"$f":"IF(【様式２・３】実施希望調書!F69=\"\",\"\",【様式２・３】実施希望調書!F69)","v":"音楽　花子"},{"$f":"IF(AL18=\"\",\"\",IF(COUNTIF($AL$1:AL18,AL18)=1,AL18,\"\"))","v":""},{"$f":"IFERROR(INDEX(AM:AM,SMALL(IF(AM:AM<>\"\",ROW(AM:AM)),ROW(AM18))),\"\")","v":""},null,"3-2",{"$f":"IF(【様式９・１０】実施報告書!F78=\"\",\"\",【様式９・１０】実施報告書!F78)","v":"音楽　花子"},{"$f":"IF(AQ18=\"\",\"\",IF(COUNTIF($AQ$1:AQ18,AQ18)=1,AQ18,\"\"))","v":""},{"$f":"IFERROR(INDEX(AR:AR,SMALL(IF(AR:AR<>\"\",ROW(AR:AR)),ROW(AR18))),\"\")","v":""}]
[null,null,null,null,"船",null,null,null,null,null,null,null,null,17,"石川県",null,null,null,null,null,null,null,null,null,null,null,null,null,null,null,null,null,null,null,null,null,"3-3",{"$f":"IF(【様式２・３】実施希望調書!F70=\"\",\"\",【様式２・３】実施希望調書!F70)","v":"演奏　太郎"},{"$f":"IF(AL19=\"\",\"\",IF(COUNTIF($AL$1:AL19,AL19)=1,AL19,\"\"))","v":""},{"$f":"IFERROR(INDEX(AM:AM,SMALL(IF(AM:AM<>\"\",ROW(AM:AM)),ROW(AM19))),\"\")","v":""},null,"3-3",{"$f":"IF(【様式９・１０】実施報告書!F79=\"\",\"\",【様式９・１０】実施報告書!F79)","v":"演奏　太郎"},{"$f":"IF(AQ19=\"\",\"\",IF(COUNTIF($AQ$1:AQ19,AQ19)=1,AQ19,\"\"))","v":""},{"$f":"IFERROR(INDEX(AR:AR,SMALL(IF(AR:AR<>\"\",ROW(AR:AR)),ROW(AR19))),\"\")","v":""}]
[null,null,null,null,"路線バス",null,null,null,null,null,null,null,null,18,"福井県",null,null,null,null,null,null,null,null,null,null,null,null,null,null,null,null,null,null,null,null,null,"3-4",{"$f":"IF(【様式２・３】実施希望調書!F71=\"\",\"\",【様式２・３】実施希望調書!F71)","v":"弦楽　花子"},{"$f":"IF(AL20=\"\",\"\",IF(COUNTIF($AL$1:AL20,AL20)=1,AL20,\"\"))","v":"弦楽　花子"},{"$f":"IFERROR(INDEX(AM:AM,SMALL(IF(AM:AM<>\"\",ROW(AM:AM)),ROW(AM20))),\"\")","v":""},null,"3-4",{"$f":"IF(【様式９・１０】実施報告書!F80=\"\",\"\",【様式９・１０】実施報告書!F80)","v":"弦楽　花子"},{"$f":"IF(AQ20=\"\",\"\",IF(COUNTIF($AQ$1:AQ20,AQ20)=1,AQ20,\"\"))","v":"弦楽　花子"},{"$f":"IFERROR(INDEX(AR:AR,SMALL(IF(AR:AR<>\"\",ROW(AR:AR)),ROW(AR20))),\"\")","v":""}]
[null,null,null,null,"自家用車",null,null,null,null,null,null,null,null,19,"山梨県",null,null,null,null,null,null,null,null,null,null,null,null,null,null,null,null,null,null,null,null,null,"3-5",{"$f":"IF(【様式２・３】実施希望調書!F72=\"\",\"\",【様式２・３】実施希望調書!F72)","v":"鍵盤　太郎"},{"$f":"IF(AL21=\"\",\"\",IF(COUNTIF($AL$1:AL21,AL21)=1,AL21,\"\"))","v":"鍵盤　太郎"},{"$f":"IFERROR(INDEX(AM:AM,SMALL(IF(AM:AM<>\"\",ROW(AM:AM)),ROW(AM21))),\"\")","v":""},null,"3-5",{"$f":"IF(【様式９・１０】実施報告書!F81=\"\",\"\",【様式９・１０】実施報告書!F81)","v":"鍵盤　太郎"},{"$f":"IF(AQ21=\"\",\"\",IF(COUNTIF($AQ$1:AQ21,AQ21)=1,AQ21,\"\"))","v":"鍵盤　太郎"},{"$f":"IFERROR(INDEX(AR:AR,SMALL(IF(AR:AR<>\"\",ROW(AR:AR)),ROW(AR21))),\"\")","v":""}]
[null,null,null,null,"自家用車(同乗)",null,null,null,null,null,null,null,null,20,"長野県",null,null,null,null,null,null,null,null,null,null,null,null,null,null,null,null,null,null,null,null,null,"3-6",{"$f":"IF(OR(OR(AND(【様式２・３】実施希望調書!$E$11=\"文化施設等\",【様式２・３】実施希望調書!$W$11=\"\"),AND(【様式２・３】実施希望調書!$E$11=\"文化施設等\",【様式２・３】実施希望調書!$W$11=\"なし\"),【様式２・３】実施希望調書!$E$11<>\"文化施設等\")),\"\",IF(【様式２・３】実施希望調書!F73=\"\",\"\",【様式２・３】実施希望調書!F73))","v":""},{"$f":"IF(AL22=\"\",\"\",IF(COUNTIF($AL$1:AL22,AL22)=1,AL22,\"\"))","v":""},{"$f":"IFERROR(INDEX(AM:AM,SMALL(IF(AM:AM<>\"\",ROW(AM:AM)),ROW(AM22))),\"\")","v":""},null,"3-6",{"$f":"IF(OR(OR(AND(【様式９・１０】実施報告書!$F$8=\"文化施設等\",【様式９・１０】実施報告書!$I$9=\"\"),AND(【様式９・１０】実施報告書!$F$8=\"文化施設等\",【様式９・１０】実施報告書!$I$9=\"なし\"),【様式９・１０】実施報告書!$F$8<>\"文化施設等\")),\"\",IF(【様式９・１０】実施報告書!F82=\"\",\"\",【様式９・１０】実施報告書!F82))","v":""},{"$f":"IF(AQ22=\"\",\"\",IF(COUNTIF($AQ$1:AQ22,AQ22)=1,AQ22,\"\"))","v":""},{"$f":"IFERROR(INDEX(AR:AR,SMALL(IF(AR:AR<>\"\",ROW(AR:AR)),ROW(AR22))),\"\")","v":""}]
[null,null,null,null,"運搬車(同乗)",null,null,null,null,null,null,null,null,21,"岐阜県",null,null,null,null,null,null,null,null,null,null,null,null,null,null,null,null,null,null,null,null,null,"3-7",{"$f":"IF(OR(OR(AND(【様式２・３】実施希望調書!$E$11=\"文化施設等\",【様式２・３】実施希望調書!$W$11=\"\"),AND(【様式２・３】実施希望調書!$E$11=\"文化施設等\",【様式２・３】実施希望調書!$W$11=\"なし\"),【様式２・３】実施希望調書!$E$11<>\"文化施設等\")),\"\",IF(【様式２・３】実施希望調書!F74=\"\",\"\",【様式２・３】実施希望調書!F74))","v":""},{"$f":"IF(AL23=\"\",\"\",IF(COUNTIF($AL$1:AL23,AL23)=1,AL23,\"\"))","v":""},{"$f":"IFERROR(INDEX(AM:AM,SMALL(IF(AM:AM<>\"\",ROW(AM:AM)),ROW(AM23))),\"\")","v":""},null,"3-7",{"$f":"IF(OR(OR(AND(【様式９・１０】実施報告書!$F$8=\"文化施設等\",【様式９・１０】実施報告書!$I$9=\"\"),AND(【様式９・１０】実施報告書!$F$8=\"文化施設等\",【様式９・１０】実施報告書!$I$9=\"なし\"),【様式９・１０】実施報告書!$F$8<>\"文化施設等\")),\"\",IF(【様式９・１０】実施報告書!F83=\"\",\"\",【様式９・１０】実施報告書!F83))","v":""},{"$f":"IF(AQ23=\"\",\"\",IF(COUNTIF($AQ$1:AQ23,AQ23)=1,AQ23,\"\"))","v":""},{"$f":"IFERROR(INDEX(AR:AR,SMALL(IF(AR:AR<>\"\",ROW(AR:AR)),ROW(AR23))),\"\")","v":""}]
[null,null,null,null,"徒歩",null,null,null,null,null,null,null,null,22,"静岡県",null,null,null,null,null,null,null,null,null,null,null,null,null,null,null,null,null,null,null,null,null,"3-8",{"$f":"IF(OR(OR(AND(【様式２・３】実施希望調書!$E$11=\"文化施設等\",【様式２・３】実施希望調書!$W$11=\"\"),AND(【様式２・３】実施希望調書!$E$11=\"文化施設等\",【様式２・３】実施希望調書!$W$11=\"なし\"),【様式２・３】実施希望調書!$E$11<>\"文化施設等\")),\"\",IF(【様式２・３】実施希望調書!F75=\"\",\"\",【様式２・３】実施希望調書!F75))","v":""},{"$f":"IF(AL24=\"\",\"\",IF(COUNTIF($AL$1:AL24,AL24)=1,AL24,\"\"))","v":""},{"$f":"IFERROR(INDEX(AM:AM,SMALL(IF(AM:AM<>\"\",ROW(AM:AM)),ROW(AM24))),\"\")","v":""},null,"3-8",{"$f":"IF(OR(OR(AND(【様式９・１０】実施報告書!$F$8=\"文化施設等\",【様式９・１０】実施報告書!$I$9=\"\"),AND(【様式９・１０】実施報告書!$F$8=\"文化施設等\",【様式９・１０】実施報告書!$I$9=\"なし\"),【様式９・１０】実施報告書!$F$8<>\"文化施設等\")),\"\",IF(【様式９・１０】実施報告書!F84=\"\",\"\",【様式９・１０】実施報告書!F84))","v":""},{"$f":"IF(AQ24=\"\",\"\",IF(COUNTIF($AQ$1:AQ24,AQ24)=1,AQ24,\"\"))","v":""},{"$f":"IFERROR(INDEX(AR:AR,SMALL(IF(AR:AR<>\"\",ROW(AR:AR)),ROW(AR24))),\"\")","v":""}]
[null,null,null,null,"その他",null,null,null,null,null,null,null,null,23,"愛知県",null,null,null,null,null,null,null,null,null,null,null,null,null,null,null,null,null,null,null,null,null,"様式2　補助者リスト",null,null,null,null,"様式9　補助者リスト"]
[null,null,null,null,null,null,null,null,null,null,null,null,null,24,"三重県"]
[null,null,null,null,null,null,null,null,null,null,null,null,null,25,"滋賀県"]
[null,null,null,null,null,null,null,null,null,null,null,null,null,26,"京都府"]
[null,null,null,null,null,null,null,null,null,null,null,null,null,27,"大阪府"]
[null,null,null,null,null,null,null,null,null,null,null,null,null,28,"兵庫県"]
[null,null,null,null,null,null,null,null,null,null,null,null,null,29,"奈良県"]
[null,null,null,null,null,null,null,null,null,null,null,null,null,30,"和歌山県"]
[null,null,null,null,null,null,null,null,null,null,null,null,null,31,"鳥取県"]
[null,null,null,null,null,null,null,null,null,null,null,null,null,32,"島根県"]
[null,null,null,null,null,null,null,null,null,null,null,null,null,33,"岡山県"]
[null,null,null,null,null,null,null,null,null,null,null,null,null,34,"広島県"]
[null,null,null,null,null,null,null,null,null,null,null,null,null,35,"山口県"]
[null,null,null,null,null,null,null,null,null,null,null,null,null,36,"徳島県"]
[null,null,null,null,null,null,null,null,null,null,null,null,null,37,"香川県"]
[null,null,null,null,null,null,null,null,null,null,null,null,null,38,"愛媛県"]
[null,null,null,null,null,null,null,null,null,null,null,null,null,39,"高知県"]
[null,null,null,null,null,null,null,null,null,null,null,null,null,40,"福岡県"]
[null,null,null,null,null,null,null,null,null,null,null,null,null,41,"佐賀県"]
[null,null,null,null,null,null,null,null,null,null,null,null,null,42,"長崎県"]
[null,null,null,null,null,null,null,null,null,null,null,null,null,43,"熊本県"]
[null,null,null,null,null,null,null,null,null,null,null,null,null,44,"大分県"]
[null,null,null,null,null,null,null,null,null,null,null,null,null,45,"宮崎県"]
[null,null,null,null,null,null,null,null,null,null,null,null,null,46,"鹿児島県"]
[null,null,null,null,null,null,null,null,null,null,null,null,null,47,"沖縄県"]
[null,null,null,null,null,null,null,null,null,null,null,null,null,48,"札幌市"]
[null,null,null,null,null,null,null,null,null,null,null,null,null,49,"仙台市"]
[null,null,null,null,null,null,null,null,null,null,null,null,null,50,"さいたま市"]
[null,null,null,null,null,null,null,null,null,null,null,null,null,51,"千葉市"]
[null,null,null,null,null,null,null,null,null,null,null,null,null,52,"横浜市"]
[null,null,null,null,null,null,null,null,null,null,null,null,null,53,"川崎市"]
[null,null,null,null,null,null,null,null,null,null,null,null,null,54,"相模原市"]
[null,null,null,null,null,null,null,null,null,null,null,null,null,55,"新潟市"]
[null,null,null,null,null,null,null,null,null,null,null,null,null,56,"静岡市"]
[null,null,null,null,null,null,null,null,null,null,null,null,null,57,"浜松市"]
[null,null,null,null,null,null,null,null,null,null,null,null,null,58,"名古屋市"]
[null,null,null,null,null,null,null,null,null,null,null,null,null,59,"京都市"]
[null,null,null,null,null,null,null,null,null,null,null,null,null,60,"大阪市"]
[null,null,null,null,null,null,null,null,null,null,null,null,null,61,"堺市"]
[null,null,null,null,null,null,null,null,null,null,null,null,null,62,"神戸市"]
[null,null,null,null,null,null,null,null,null,null,null,null,null,63,"岡山市"]
[null,null,null,null,null,null,null,null,null,null,null,null,null,64,"広島市"]
[null,null,null,null,null,null,null,null,null,null,null,null,null,65,"北九州市"]
[null,null,null,null,null,null,null,null,null,null,null,null,null,66,"福岡市"]
[null,null,null,null,null,null,null,null,null,null,null,null,null,67,"熊本市"]